BDBM4549 4-Phenylamino 3-quinolinecarbonitrile deriv. 26::4-[(2,4-Dichloro-5-methoxyphenyl)amino]-6-methoxy-7-[2-(4-morpholinyl)ethoxy]-3-quinolinecarbonitrile::4-[(2,4-dichloro-5-methoxyphenyl)amino]-6-methoxy-7-[2-(morpholin-4-yl)ethoxy]quinoline-3-carbonitrile
SMILES: COc1cc(Nc2c(cnc3cc(OCCN4CCOCC4)c(OC)cc23)C#N)c(Cl)cc1Cl
InChI Key: InChIKey=LPZXIIKERBMSSI-UHFFFAOYSA-N
Data: 1 IC50
Activity Spreadsheet -- Enzyme Inhibition Constant Data from BindingDB
Found 1 hit for monomerid = 4549
Trg + Lig
Ki
nM
ΔG°
kcal/mole
IC50
nM
Kd
nM
EC50/IC50
nM
koff
s-1
kon
M-1s-1
pHTemp
°C
Proto-oncogene tyrosine-protein kinase Src
(Homo sapiens (Human))
BDBM4549
(4-Phenylamino 3-quinolinecarbonitrile deriv. 26 | ...)
Show SMILES COc1cc(Nc2c(cnc3cc(OCCN4CCOCC4)c(OC)cc23)C#N)c(Cl)cc1Cl
Show InChI InChI=1S/C24H24Cl2N4O4/c1-31-21-12-20(17(25)10-18(21)26)29-24-15(13-27)14-28-19-11-23(22(32-2)9-16(19)24)34-8-5-30-3-6-33-7-4-30/h9-12,14H,3-8H2,1-2H3,(H,28,29)
n/an/a 2.30n/an/an/an/an/an/a
Wyeth-Ayerst Research
Assay Description
Src kinase activity was measured in an ELISA format. IC50 is the inhibitor concentration which inhibits 50% of kinase activity that catalyzes the tra...
J Med Chem 44: 3965-77 (2001)
Article DOI: 10.1021/jm0102250
BindingDB Entry DOI: 10.7270/Q2TD9VHP