BDBM4553 4-Phenylamino-3-quinolinecarbonitrile deriv. 31b::4-[(2,4-Dichloro-5-methoxyphenyl)amino]-7-[3-(4-ethyl-1-piperazinyl)propoxy]-6-methoxy-3-quinolinecarbonitrile::4-[(2,4-dichloro-5-methoxyphenyl)amino]-7-[3-(4-ethylpiperazin-1-yl)propoxy]-6-methoxyquinoline-3-carbonitrile
SMILES: CCN1CCN(CCCOc2cc3ncc(C#N)c(Nc4cc(OC)c(Cl)cc4Cl)c3cc2OC)CC1
InChI Key: InChIKey=BIEFBSIFAKMKOT-UHFFFAOYSA-N
Data: 1 IC50
Activity Spreadsheet -- Enzyme Inhibition Constant Data from BindingDB
Found 1 hit for monomerid = 4553
Trg + Lig
Ki
nM
ΔG°
kcal/mole
IC50
nM
Kd
nM
EC50/IC50
nM
koff
s-1
kon
M-1s-1
pHTemp
°C
Proto-oncogene tyrosine-protein kinase Src
(Homo sapiens (Human))
BDBM4553
(4-Phenylamino-3-quinolinecarbonitrile deriv. 31b |...)
Show SMILES CCN1CCN(CCCOc2cc3ncc(C#N)c(Nc4cc(OC)c(Cl)cc4Cl)c3cc2OC)CC1
Show InChI InChI=1S/C27H31Cl2N5O3/c1-4-33-7-9-34(10-8-33)6-5-11-37-26-14-22-19(12-25(26)36-3)27(18(16-30)17-31-22)32-23-15-24(35-2)21(29)13-20(23)28/h12-15,17H,4-11H2,1-3H3,(H,31,32)
n/an/a 0.770n/an/an/an/an/an/a
Wyeth-Ayerst Research
Assay Description
Src kinase activity was measured in an ELISA format. IC50 is the inhibitor concentration which inhibits 50% of kinase activity that catalyzes the tra...
J Med Chem 44: 3965-77 (2001)
Article DOI: 10.1021/jm0102250
BindingDB Entry DOI: 10.7270/Q2TD9VHP