BDBM4555 4-Phenylamino-3-quinolinecarbonitrile deriv. 31d::4-[(2,4-Dichloro-5-methoxyphenyl)amino]-6-methoxy-7-[3-(4-propyl-1-piperazinyl)propoxy]-3-quinolinecarbonitrile::4-[(2,4-dichloro-5-methoxyphenyl)amino]-6-methoxy-7-[3-(4-propylpiperazin-1-yl)propoxy]quinoline-3-carbonitrile
SMILES: CCCN1CCN(CCCOc2cc3ncc(C#N)c(Nc4cc(OC)c(Cl)cc4Cl)c3cc2OC)CC1
InChI Key: InChIKey=SUGCHLACYQMXHH-UHFFFAOYSA-N
Data: 1 IC50
Activity Spreadsheet -- Enzyme Inhibition Constant Data from BindingDB
Found 1 hit for monomerid = 4555
Trg + Lig
Ki
nM
ΔG°
kcal/mole
IC50
nM
Kd
nM
EC50/IC50
nM
koff
s-1
kon
M-1s-1
pHTemp
°C
Proto-oncogene tyrosine-protein kinase Src
(Homo sapiens (Human))
BDBM4555
(4-Phenylamino-3-quinolinecarbonitrile deriv. 31d |...)
Show SMILES CCCN1CCN(CCCOc2cc3ncc(C#N)c(Nc4cc(OC)c(Cl)cc4Cl)c3cc2OC)CC1
Show InChI InChI=1S/C28H33Cl2N5O3/c1-4-6-34-8-10-35(11-9-34)7-5-12-38-27-15-23-20(13-26(27)37-3)28(19(17-31)18-32-23)33-24-16-25(36-2)22(30)14-21(24)29/h13-16,18H,4-12H2,1-3H3,(H,32,33)
n/an/a 1.10n/an/an/an/an/an/a
Wyeth-Ayerst Research
Assay Description
Src kinase activity was measured in an ELISA format. IC50 is the inhibitor concentration which inhibits 50% of kinase activity that catalyzes the tra...
J Med Chem 44: 3965-77 (2001)
Article DOI: 10.1021/jm0102250
BindingDB Entry DOI: 10.7270/Q2TD9VHP