BDBM4556 4-Phenylamino-3-quinolinecarbonitrile deriv. 31e::4-[(2,4-Dichloro-5-methoxyphenyl)amino]-6-methoxy-7-(3-piperazin-1-ylpropoxy)-3-quinolinecarbonitrile::4-[(2,4-dichloro-5-methoxyphenyl)amino]-6-methoxy-7-[3-(piperazin-1-yl)propoxy]quinoline-3-carbonitrile
SMILES: COc1cc(Nc2c(cnc3cc(OCCCN4CCNCC4)c(OC)cc23)C#N)c(Cl)cc1Cl
InChI Key: InChIKey=WJNXCARNBUNEMQ-UHFFFAOYSA-N
Data: 1 IC50
Activity Spreadsheet -- Enzyme Inhibition Constant Data from BindingDB
Found 1 hit for monomerid = 4556
Trg + Lig
Ki
nM
ΔG°
kcal/mole
IC50
nM
Kd
nM
EC50/IC50
nM
koff
s-1
kon
M-1s-1
pHTemp
°C
Proto-oncogene tyrosine-protein kinase Src
(Homo sapiens (Human))
BDBM4556
(4-Phenylamino-3-quinolinecarbonitrile deriv. 31e |...)
Show SMILES COc1cc(Nc2c(cnc3cc(OCCCN4CCNCC4)c(OC)cc23)C#N)c(Cl)cc1Cl
Show InChI InChI=1S/C25H27Cl2N5O3/c1-33-22-13-21(18(26)11-19(22)27)31-25-16(14-28)15-30-20-12-24(23(34-2)10-17(20)25)35-9-3-6-32-7-4-29-5-8-32/h10-13,15,29H,3-9H2,1-2H3,(H,30,31)
n/an/a 1.10n/an/an/an/an/an/a
Wyeth-Ayerst Research
Assay Description
Src kinase activity was measured in an ELISA format. IC50 is the inhibitor concentration which inhibits 50% of kinase activity that catalyzes the tra...
J Med Chem 44: 3965-77 (2001)
Article DOI: 10.1021/jm0102250
BindingDB Entry DOI: 10.7270/Q2TD9VHP