BDBM4557 4-Phenylamino-3-quinolinecarbonitrile deriv. 31f::4-[(2,4-Dichloro-5-methoxyphenyl)amino]-6-methoxy-7-{3-[4-(2-hydroxyethyl)piperazin-1-yl]propoxy}-3-quinolinecarbonitrile::4-[(2,4-dichloro-5-methoxyphenyl)amino]-7-{3-[4-(2-hydroxyethyl)piperazin-1-yl]propoxy}-6-methoxyquinoline-3-carbonitrile
SMILES: COc1cc(Nc2c(cnc3cc(OCCCN4CCN(CCO)CC4)c(OC)cc23)C#N)c(Cl)cc1Cl
InChI Key: InChIKey=GCFYFSXVZCZHBK-UHFFFAOYSA-N
Data: 1 IC50
Activity Spreadsheet -- Enzyme Inhibition Constant Data from BindingDB
Found 1 hit for monomerid = 4557
Trg + Lig
Ki
nM
ΔG°
kcal/mole
IC50
nM
Kd
nM
EC50/IC50
nM
koff
s-1
kon
M-1s-1
pHTemp
°C
Proto-oncogene tyrosine-protein kinase Src
(Homo sapiens (Human))
BDBM4557
(4-Phenylamino-3-quinolinecarbonitrile deriv. 31f |...)
Show SMILES COc1cc(Nc2c(cnc3cc(OCCCN4CCN(CCO)CC4)c(OC)cc23)C#N)c(Cl)cc1Cl
Show InChI InChI=1S/C27H31Cl2N5O4/c1-36-24-15-23(20(28)13-21(24)29)32-27-18(16-30)17-31-22-14-26(25(37-2)12-19(22)27)38-11-3-4-33-5-7-34(8-6-33)9-10-35/h12-15,17,35H,3-11H2,1-2H3,(H,31,32)
n/an/a 0.760n/an/an/an/an/an/a
Wyeth-Ayerst Research
Assay Description
Src kinase activity was measured in an ELISA format. IC50 is the inhibitor concentration which inhibits 50% of kinase activity that catalyzes the tra...
J Med Chem 44: 3965-77 (2001)
Article DOI: 10.1021/jm0102250
BindingDB Entry DOI: 10.7270/Q2TD9VHP