BDBM4568 4-anilinoquinazoline deriv. 10a::N-{4-[(3-bromophenyl)amino]quinazolin-6-yl}-4-(dimethylamino)but-2-ynamide
SMILES: CN(C)CC#CC(=O)Nc1ccc2ncnc(Nc3cccc(Br)c3)c2c1
InChI Key: InChIKey=OTMPOVZNMVTURI-UHFFFAOYSA-N
Data: 3 IC50
Activity Spreadsheet -- Enzyme Inhibition Constant Data from BindingDB
Found 3 hits for monomerid = 4568
Trg + Lig
Ki
nM
ΔG°
kcal/mole
IC50
nM
Kd
nM
EC50/IC50
nM
koff
s-1
kon
M-1s-1
pHTemp
°C
Epidermal growth factor receptor
(Homo sapiens (Human))
BDBM4568
(4-anilinoquinazoline deriv. 10a | N-{4-[(3-bromoph...)
Show SMILES CN(C)CC#CC(=O)Nc1ccc2ncnc(Nc3cccc(Br)c3)c2c1
Show InChI InChI=1S/C20H18BrN5O/c1-26(2)10-4-7-19(27)24-16-8-9-18-17(12-16)20(23-13-22-18)25-15-6-3-5-14(21)11-15/h3,5-6,8-9,11-13H,10H2,1-2H3,(H,24,27)(H,22,23,25)
n/an/a 6n/an/an/an/a7.422
Wyeth-Ayerst Research
Assay Description
The EGF-R kinase autophosphorylation activity was measured by DELFIA/time-resolved fluorometry with excitation at 340 nm and emission at 615 nm. Po...
J Med Chem 44: 2719-34 (2001)
Article DOI: 10.1021/jm0005555
BindingDB Entry DOI: 10.7270/Q2PN93TS
Epidermal growth factor receptor
(Homo sapiens (Human))
BDBM4568
(4-anilinoquinazoline deriv. 10a | N-{4-[(3-bromoph...)
Show SMILES CN(C)CC#CC(=O)Nc1ccc2ncnc(Nc3cccc(Br)c3)c2c1
Show InChI InChI=1S/C20H18BrN5O/c1-26(2)10-4-7-19(27)24-16-8-9-18-17(12-16)20(23-13-22-18)25-15-6-3-5-14(21)11-15/h3,5-6,8-9,11-13H,10H2,1-2H3,(H,24,27)(H,22,23,25)
n/an/a 6n/an/an/an/an/an/a
Universit£ di Pisa
Curated by ChEMBL
Assay Description
Inhibition of human recombinant EGFR
J Med Chem 52: 964-75 (2009)
Article DOI: 10.1021/jm800829v
BindingDB Entry DOI: 10.7270/Q27W6C7Q
Receptor tyrosine-protein kinase erbB-2
(Homo sapiens (Human))
BDBM4568
(4-anilinoquinazoline deriv. 10a | N-{4-[(3-bromoph...)
Show SMILES CN(C)CC#CC(=O)Nc1ccc2ncnc(Nc3cccc(Br)c3)c2c1
Show InChI InChI=1S/C20H18BrN5O/c1-26(2)10-4-7-19(27)24-16-8-9-18-17(12-16)20(23-13-22-18)25-15-6-3-5-14(21)11-15/h3,5-6,8-9,11-13H,10H2,1-2H3,(H,24,27)(H,22,23,25)
n/an/a 14n/an/an/an/an/an/a
Wyeth-Ayerst Research
Assay Description
The HER-2 kinase autophosphorylation activity was measured by DELFIA/time-resolved fluorometry with excitation at 340 nm and emission at 615 nm. Po...
J Med Chem 44: 2719-34 (2001)
Article DOI: 10.1021/jm0005555
BindingDB Entry DOI: 10.7270/Q2PN93TS