BDBM4573 4-anilinoquinazoline deriv. 10f::N-{4-[(3-bromophenyl)amino]quinazolin-6-yl}-4-[methyl(prop-2-en-1-yl)amino]but-2-ynamide
SMILES: CN(CC=C)CC#CC(=O)Nc1ccc2ncnc(Nc3cccc(Br)c3)c2c1
InChI Key: InChIKey=BFXGHOJOXUBCTO-UHFFFAOYSA-N
Data: 2 IC50
Activity Spreadsheet -- Enzyme Inhibition Constant Data from BindingDB
Found 2 hits for monomerid = 4573
Trg + Lig
Ki
nM
ΔG°
kcal/mole
IC50
nM
Kd
nM
EC50/IC50
nM
koff
s-1
kon
M-1s-1
pHTemp
°C
Receptor tyrosine-protein kinase erbB-2
(Homo sapiens (Human))
BDBM4573
(4-anilinoquinazoline deriv. 10f | N-{4-[(3-bromoph...)
Show SMILES CN(CC=C)CC#CC(=O)Nc1ccc2ncnc(Nc3cccc(Br)c3)c2c1
Show InChI InChI=1S/C22H20BrN5O/c1-3-11-28(2)12-5-8-21(29)26-18-9-10-20-19(14-18)22(25-15-24-20)27-17-7-4-6-16(23)13-17/h3-4,6-7,9-10,13-15H,1,11-12H2,2H3,(H,26,29)(H,24,25,27)
n/an/a 85n/an/an/an/an/an/a
Wyeth-Ayerst Research
Assay Description
The HER-2 kinase autophosphorylation activity was measured by DELFIA/time-resolved fluorometry with excitation at 340 nm and emission at 615 nm. Po...
J Med Chem 44: 2719-34 (2001)
Article DOI: 10.1021/jm0005555
BindingDB Entry DOI: 10.7270/Q2PN93TS
Epidermal growth factor receptor
(Homo sapiens (Human))
BDBM4573
(4-anilinoquinazoline deriv. 10f | N-{4-[(3-bromoph...)
Show SMILES CN(CC=C)CC#CC(=O)Nc1ccc2ncnc(Nc3cccc(Br)c3)c2c1
Show InChI InChI=1S/C22H20BrN5O/c1-3-11-28(2)12-5-8-21(29)26-18-9-10-20-19(14-18)22(25-15-24-20)27-17-7-4-6-16(23)13-17/h3-4,6-7,9-10,13-15H,1,11-12H2,2H3,(H,26,29)(H,24,25,27)
n/an/a 71n/an/an/an/a7.422
Wyeth-Ayerst Research
Assay Description
The EGF-R kinase autophosphorylation activity was measured by DELFIA/time-resolved fluorometry with excitation at 340 nm and emission at 615 nm. Po...
J Med Chem 44: 2719-34 (2001)
Article DOI: 10.1021/jm0005555
BindingDB Entry DOI: 10.7270/Q2PN93TS