BDBM4578 4-anilinoquinazoline deriv. 10k::N-{4-[(3-bromophenyl)amino]quinazolin-6-yl}-4-(4-ethylpiperazin-1-yl)but-2-ynamide
SMILES: CCN1CCN(CC#CC(=O)Nc2ccc3ncnc(Nc4cccc(Br)c4)c3c2)CC1
InChI Key: InChIKey=JEZCURNCWCILAV-UHFFFAOYSA-N
Data: 2 IC50
Activity Spreadsheet -- Enzyme Inhibition Constant Data from BindingDB
Found 2 hits for monomerid = 4578
Trg + Lig
Ki
nM
ΔG°
kcal/mole
IC50
nM
Kd
nM
EC50/IC50
nM
koff
s-1
kon
M-1s-1
pHTemp
°C
Receptor tyrosine-protein kinase erbB-2
(Homo sapiens (Human))
BDBM4578
(4-anilinoquinazoline deriv. 10k | N-{4-[(3-bromoph...)
Show SMILES CCN1CCN(CC#CC(=O)Nc2ccc3ncnc(Nc4cccc(Br)c4)c3c2)CC1
Show InChI InChI=1S/C24H25BrN6O/c1-2-30-11-13-31(14-12-30)10-4-7-23(32)28-20-8-9-22-21(16-20)24(27-17-26-22)29-19-6-3-5-18(25)15-19/h3,5-6,8-9,15-17H,2,10-14H2,1H3,(H,28,32)(H,26,27,29)
n/an/a 183n/an/an/an/an/an/a
Wyeth-Ayerst Research
Assay Description
The HER-2 kinase autophosphorylation activity was measured by DELFIA/time-resolved fluorometry with excitation at 340 nm and emission at 615 nm. Po...
J Med Chem 44: 2719-34 (2001)
Article DOI: 10.1021/jm0005555
BindingDB Entry DOI: 10.7270/Q2PN93TS
Epidermal growth factor receptor
(Homo sapiens (Human))
BDBM4578
(4-anilinoquinazoline deriv. 10k | N-{4-[(3-bromoph...)
Show SMILES CCN1CCN(CC#CC(=O)Nc2ccc3ncnc(Nc4cccc(Br)c4)c3c2)CC1
Show InChI InChI=1S/C24H25BrN6O/c1-2-30-11-13-31(14-12-30)10-4-7-23(32)28-20-8-9-22-21(16-20)24(27-17-26-22)29-19-6-3-5-18(25)15-19/h3,5-6,8-9,15-17H,2,10-14H2,1H3,(H,28,32)(H,26,27,29)
n/an/a 65n/an/an/an/a7.422
Wyeth-Ayerst Research
Assay Description
The EGF-R kinase autophosphorylation activity was measured by DELFIA/time-resolved fluorometry with excitation at 340 nm and emission at 615 nm. Po...
J Med Chem 44: 2719-34 (2001)
Article DOI: 10.1021/jm0005555
BindingDB Entry DOI: 10.7270/Q2PN93TS