null
SMILES: CN1CCC=C(C1)C(=O)Nc1ccc2ncnc(Nc3cccc(Br)c3)c2c1
InChI Key: InChIKey=QHSKAAHDPBBIMT-UHFFFAOYSA-N
Activity Spreadsheet -- Enzyme Inhibition Constant Data from BindingDB
Found 2 hits for monomerid = 4598
Trg + Lig
Ki
nM
ΔG°
kcal/mole
IC50
nM
Kd
nM
EC50/IC50
nM
koff
s-1
kon
M-1s-1
pHTemp
°C
Receptor tyrosine-protein kinase erbB-2
(Homo sapiens (Human))
BDBM4598
(4-anilinoquinazoline deriv. 20 | N-{4-[(3-bromophe...)
Show SMILES CN1CCC=C(C1)C(=O)Nc1ccc2ncnc(Nc3cccc(Br)c3)c2c1 |c:4|
Show InChI InChI=1S/C21H20BrN5O/c1-27-9-3-4-14(12-27)21(28)26-17-7-8-19-18(11-17)20(24-13-23-19)25-16-6-2-5-15(22)10-16/h2,4-8,10-11,13H,3,9,12H2,1H3,(H,26,28)(H,23,24,25)
n/an/a 5.04E+3n/an/an/an/an/an/a
Wyeth-Ayerst Research
Assay Description
The HER-2 kinase autophosphorylation activity was measured by DELFIA/time-resolved fluorometry with excitation at 340 nm and emission at 615 nm. Po...
J Med Chem 44: 2719-34 (2001)
Article DOI: 10.1021/jm0005555
BindingDB Entry DOI: 10.7270/Q2PN93TS
Epidermal growth factor receptor
(Homo sapiens (Human))
BDBM4598
(4-anilinoquinazoline deriv. 20 | N-{4-[(3-bromophe...)
Show SMILES CN1CCC=C(C1)C(=O)Nc1ccc2ncnc(Nc3cccc(Br)c3)c2c1 |c:4|
Show InChI InChI=1S/C21H20BrN5O/c1-27-9-3-4-14(12-27)21(28)26-17-7-8-19-18(11-17)20(24-13-23-19)25-16-6-2-5-15(22)10-16/h2,4-8,10-11,13H,3,9,12H2,1H3,(H,26,28)(H,23,24,25)
n/an/a 115n/an/an/an/an/an/a
Wyeth-Ayerst Research
Assay Description
The EGF-R kinase autophosphorylation activity was measured by DELFIA/time-resolved fluorometry with excitation at 340 nm and emission at 615 nm. Po...
J Med Chem 44: 2719-34 (2001)
Article DOI: 10.1021/jm0005555
BindingDB Entry DOI: 10.7270/Q2PN93TS