null
SMILES: Brc1cccc(Nc2ncnc3ccc(NC(=O)C(=C)CN4CCOCC4)cc23)c1
InChI Key: InChIKey=VANCZLKVOHARGS-UHFFFAOYSA-N
Activity Spreadsheet -- Enzyme Inhibition Constant Data from BindingDB
Found 2 hits for monomerid = 4599
Trg + Lig
Ki
nM
ΔG°
kcal/mole
IC50
nM
Kd
nM
EC50/IC50
nM
koff
s-1
kon
M-1s-1
pHTemp
°C
Receptor tyrosine-protein kinase erbB-2
(Homo sapiens (Human))
BDBM4599
(4-anilinoquinazoline deriv. 23 | N-{4-[(3-bromophe...)
Show SMILES Brc1cccc(Nc2ncnc3ccc(NC(=O)C(=C)CN4CCOCC4)cc23)c1
Show InChI InChI=1S/C22H22BrN5O2/c1-15(13-28-7-9-30-10-8-28)22(29)27-18-5-6-20-19(12-18)21(25-14-24-20)26-17-4-2-3-16(23)11-17/h2-6,11-12,14H,1,7-10,13H2,(H,27,29)(H,24,25,26)
n/an/a 458n/an/an/an/an/an/a
Wyeth-Ayerst Research
Assay Description
The HER-2 kinase autophosphorylation activity was measured by DELFIA/time-resolved fluorometry with excitation at 340 nm and emission at 615 nm. Po...
J Med Chem 44: 2719-34 (2001)
Article DOI: 10.1021/jm0005555
BindingDB Entry DOI: 10.7270/Q2PN93TS
Epidermal growth factor receptor
(Homo sapiens (Human))
BDBM4599
(4-anilinoquinazoline deriv. 23 | N-{4-[(3-bromophe...)
Show SMILES Brc1cccc(Nc2ncnc3ccc(NC(=O)C(=C)CN4CCOCC4)cc23)c1
Show InChI InChI=1S/C22H22BrN5O2/c1-15(13-28-7-9-30-10-8-28)22(29)27-18-5-6-20-19(12-18)21(25-14-24-20)26-17-4-2-3-16(23)11-17/h2-6,11-12,14H,1,7-10,13H2,(H,27,29)(H,24,25,26)
n/an/a 107n/an/an/an/an/an/a
Wyeth-Ayerst Research
Assay Description
The EGF-R kinase autophosphorylation activity was measured by DELFIA/time-resolved fluorometry with excitation at 340 nm and emission at 615 nm. Po...
J Med Chem 44: 2719-34 (2001)
Article DOI: 10.1021/jm0005555
BindingDB Entry DOI: 10.7270/Q2PN93TS