BDBM46008 US8901087, 96
SMILES: CN(C)C1=N[C@H]2[C@H](O[C@H](C(O)C3SCCCS3)[C@@H](COCc3ccccc3)[C@@H]2OCc2ccccc2)S1
InChI Key: InChIKey=IYBLYBDKLNYSLR-RAANROPKSA-N
Data: 1 KI
Activity Spreadsheet -- Enzyme Inhibition Constant Data from BindingDB
Found 1 hit for monomerid = 46008
Trg + Lig
Ki
nM
ΔG°
kcal/mole
IC50
nM
Kd
nM
EC50/IC50
nM
koff
s-1
kon
M-1s-1
pHTemp
°C
N-acetyl-beta-D-glucosaminidase (O-GlcNAcase)
(Homo sapiens (Human))
BDBM46008
(US8901087, 96)
Show SMILES CN(C)C1=N[C@H]2[C@H](O[C@H](C(O)C3SCCCS3)[C@@H](COCc3ccccc3)[C@@H]2OCc2ccccc2)S1 |t:3|
Show InChI InChI=1S/C28H36N2O4S3/c1-30(2)28-29-22-24(33-17-20-12-7-4-8-13-20)21(18-32-16-19-10-5-3-6-11-19)25(34-26(22)37-28)23(31)27-35-14-9-15-36-27/h3-8,10-13,21-27,31H,9,14-18H2,1-2H3/t21-,22+,23?,24-,25-,26+/m0/s1
US Patent
0.190 -13.3n/an/an/an/an/a7.025
Merck Sharp & Dohme Corp.
US Patent
Assay Description
Enzymatic reactions are carried out in a reaction containing 50 mM NaH2PO4, 100 mM NaCl and 0.1% BSA (pH 7.0) using 2 mM 4-Methylumbelliferyl N-acety...
US Patent US8901087 (2014)
BindingDB Entry DOI: 10.7270/Q24B301W