BDBM4603 (2Z)-N-{4-[(3-bromophenyl)amino]quinazolin-6-yl}-4-[(2S)-2-(methoxymethyl)pyrrolidin-1-yl]but-2-enamide::4-anilinoquinazoline deriv. 27
SMILES: COC[C@@H]1CCCN1C\C=C/C(=O)Nc1ccc2ncnc(Nc3cccc(Br)c3)c2c1
InChI Key: InChIKey=RHVQWSMLJGXEQH-CWWFIGIMSA-N
Data: 2 IC50
Activity Spreadsheet -- Enzyme Inhibition Constant Data from BindingDB
Found 2 hits for monomerid = 4603
Trg + Lig
Ki
nM
ΔG°
kcal/mole
IC50
nM
Kd
nM
EC50/IC50
nM
koff
s-1
kon
M-1s-1
pHTemp
°C
Receptor tyrosine-protein kinase erbB-2
(Homo sapiens (Human))
BDBM4603
((2Z)-N-{4-[(3-bromophenyl)amino]quinazolin-6-yl}-4...)
Show SMILES COC[C@@H]1CCCN1C\C=C/C(=O)Nc1ccc2ncnc(Nc3cccc(Br)c3)c2c1 |r|
Show InChI InChI=1S/C24H26BrN5O2/c1-32-15-20-7-3-11-30(20)12-4-8-23(31)28-19-9-10-22-21(14-19)24(27-16-26-22)29-18-6-2-5-17(25)13-18/h2,4-6,8-10,13-14,16,20H,3,7,11-12,15H2,1H3,(H,28,31)(H,26,27,29)/b8-4-/t20-/m0/s1
n/an/a 2.92E+3n/an/an/an/an/an/a
Wyeth-Ayerst Research
Assay Description
The HER-2 kinase autophosphorylation activity was measured by DELFIA/time-resolved fluorometry with excitation at 340 nm and emission at 615 nm. Po...
J Med Chem 44: 2719-34 (2001)
Article DOI: 10.1021/jm0005555
BindingDB Entry DOI: 10.7270/Q2PN93TS
Epidermal growth factor receptor
(Homo sapiens (Human))
BDBM4603
((2Z)-N-{4-[(3-bromophenyl)amino]quinazolin-6-yl}-4...)
Show SMILES COC[C@@H]1CCCN1C\C=C/C(=O)Nc1ccc2ncnc(Nc3cccc(Br)c3)c2c1 |r|
Show InChI InChI=1S/C24H26BrN5O2/c1-32-15-20-7-3-11-30(20)12-4-8-23(31)28-19-9-10-22-21(14-19)24(27-16-26-22)29-18-6-2-5-17(25)13-18/h2,4-6,8-10,13-14,16,20H,3,7,11-12,15H2,1H3,(H,28,31)(H,26,27,29)/b8-4-/t20-/m0/s1
n/an/a 194n/an/an/an/an/an/a
Wyeth-Ayerst Research
Assay Description
The EGF-R kinase autophosphorylation activity was measured by DELFIA/time-resolved fluorometry with excitation at 340 nm and emission at 615 nm. Po...
J Med Chem 44: 2719-34 (2001)
Article DOI: 10.1021/jm0005555
BindingDB Entry DOI: 10.7270/Q2PN93TS