BDBM4613 1,6-naphthyridine deriv. 15::1-[7-amino-3-(3,5-dimethoxyphenyl)-1,6-naphthyridin-2-yl]-3-tert-butylurea::N-[7-Amino-3-(3,5-dimethoxyphenyl)-1,6-naphthyridin-2-yl]-N-tert-butylurea
SMILES: COc1cc(OC)cc(c1)-c1cc2cnc(N)cc2nc1NC(=O)NC(C)(C)C
InChI Key: InChIKey=MCZADMNBTWSHHB-UHFFFAOYSA-N
Data: 3 IC50
Activity Spreadsheet -- Enzyme Inhibition Constant Data from BindingDB
Found 3 hits for monomerid = 4613
Trg + Lig
Ki
nM
ΔG°
kcal/mole
IC50
nM
Kd
nM
EC50/IC50
nM
koff
s-1
kon
M-1s-1
pHTemp
°C
Fibroblast growth factor receptor 1
(Homo sapiens (Human))
BDBM4613
(1,6-naphthyridine deriv. 15 | 1-[7-amino-3-(3,5-di...)
Show SMILES COc1cc(OC)cc(c1)-c1cc2cnc(N)cc2nc1NC(=O)NC(C)(C)C
Show InChI InChI=1S/C21H25N5O3/c1-21(2,3)26-20(27)25-19-16(8-13-11-23-18(22)10-17(13)24-19)12-6-14(28-4)9-15(7-12)29-5/h6-11H,1-5H3,(H2,22,23)(H2,24,25,26,27)
NCI pathway
Reactome pathway
n/an/a 42n/an/an/an/a7.425
University of Auckland
Assay Description
IC50 is the inhibitor concentration which inhibits 50% of kinase activity that catalyzes the transfer of the terminal phosphate from [gamma-32P] labe...
J Med Chem 43: 4200-11 (2000)
Article DOI: 10.1021/jm000161d
BindingDB Entry DOI: 10.7270/Q2JW8C3G
Proto-oncogene tyrosine-protein kinase Src
(Homo sapiens (Human))
BDBM4613
(1,6-naphthyridine deriv. 15 | 1-[7-amino-3-(3,5-di...)
Show SMILES COc1cc(OC)cc(c1)-c1cc2cnc(N)cc2nc1NC(=O)NC(C)(C)C
Show InChI InChI=1S/C21H25N5O3/c1-21(2,3)26-20(27)25-19-16(8-13-11-23-18(22)10-17(13)24-19)12-6-14(28-4)9-15(7-12)29-5/h6-11H,1-5H3,(H2,22,23)(H2,24,25,26,27)
n/an/a>5.00E+4n/an/an/an/an/an/a
University of Auckland
Assay Description
IC50 is the inhibitor concentration which inhibits 50% of kinase activity that catalyzes the transfer of the terminal phosphate from [gamma-32P] labe...
J Med Chem 43: 4200-11 (2000)
Article DOI: 10.1021/jm000161d
BindingDB Entry DOI: 10.7270/Q2JW8C3G
Platelet-derived growth factor receptor beta
(Homo sapiens (Human))
BDBM4613
(1,6-naphthyridine deriv. 15 | 1-[7-amino-3-(3,5-di...)
Show SMILES COc1cc(OC)cc(c1)-c1cc2cnc(N)cc2nc1NC(=O)NC(C)(C)C
Show InChI InChI=1S/C21H25N5O3/c1-21(2,3)26-20(27)25-19-16(8-13-11-23-18(22)10-17(13)24-19)12-6-14(28-4)9-15(7-12)29-5/h6-11H,1-5H3,(H2,22,23)(H2,24,25,26,27)
NCI pathway
Reactome pathway
n/an/a 3.80E+4n/an/an/an/an/an/a
University of Auckland
Assay Description
IC50 is the inhibitor concentration which inhibits 50% of kinase activity that catalyzes the transfer of the terminal phosphate from [gamma-32P] labe...
J Med Chem 43: 4200-11 (2000)
Article DOI: 10.1021/jm000161d
BindingDB Entry DOI: 10.7270/Q2JW8C3G