null
SMILES: COc1cc(OC)cc(c1)-c1cc2cnc(N)cc2nc1NC(=O)Nc1ccccc1
InChI Key: InChIKey=GVPPAUNFTPWQSI-UHFFFAOYSA-N
Activity Spreadsheet -- Enzyme Inhibition Constant Data from BindingDB
Found 3 hits for monomerid = 4614
Trg + Lig
Ki
nM
ΔG°
kcal/mole
IC50
nM
Kd
nM
EC50/IC50
nM
koff
s-1
kon
M-1s-1
pHTemp
°C
Fibroblast growth factor receptor 1
(Homo sapiens (Human))
BDBM4614
(1,6-naphthyridine deriv. 16 | 3-[7-amino-3-(3,5-di...)
Show SMILES COc1cc(OC)cc(c1)-c1cc2cnc(N)cc2nc1NC(=O)Nc1ccccc1
Show InChI InChI=1S/C23H21N5O3/c1-30-17-8-14(9-18(11-17)31-2)19-10-15-13-25-21(24)12-20(15)27-22(19)28-23(29)26-16-6-4-3-5-7-16/h3-13H,1-2H3,(H2,24,25)(H2,26,27,28,29)
NCI pathway
Reactome pathway
n/an/a 510n/an/an/an/a7.425
University of Auckland
Assay Description
IC50 is the inhibitor concentration which inhibits 50% of kinase activity that catalyzes the transfer of the terminal phosphate from [gamma-32P] labe...
J Med Chem 43: 4200-11 (2000)
Article DOI: 10.1021/jm000161d
BindingDB Entry DOI: 10.7270/Q2JW8C3G
Proto-oncogene tyrosine-protein kinase Src
(Homo sapiens (Human))
BDBM4614
(1,6-naphthyridine deriv. 16 | 3-[7-amino-3-(3,5-di...)
Show SMILES COc1cc(OC)cc(c1)-c1cc2cnc(N)cc2nc1NC(=O)Nc1ccccc1
Show InChI InChI=1S/C23H21N5O3/c1-30-17-8-14(9-18(11-17)31-2)19-10-15-13-25-21(24)12-20(15)27-22(19)28-23(29)26-16-6-4-3-5-7-16/h3-13H,1-2H3,(H2,24,25)(H2,26,27,28,29)
n/an/a>5.00E+4n/an/an/an/an/an/a
University of Auckland
Assay Description
IC50 is the inhibitor concentration which inhibits 50% of kinase activity that catalyzes the transfer of the terminal phosphate from [gamma-32P] labe...
J Med Chem 43: 4200-11 (2000)
Article DOI: 10.1021/jm000161d
BindingDB Entry DOI: 10.7270/Q2JW8C3G
Platelet-derived growth factor receptor beta
(Homo sapiens (Human))
BDBM4614
(1,6-naphthyridine deriv. 16 | 3-[7-amino-3-(3,5-di...)
Show SMILES COc1cc(OC)cc(c1)-c1cc2cnc(N)cc2nc1NC(=O)Nc1ccccc1
Show InChI InChI=1S/C23H21N5O3/c1-30-17-8-14(9-18(11-17)31-2)19-10-15-13-25-21(24)12-20(15)27-22(19)28-23(29)26-16-6-4-3-5-7-16/h3-13H,1-2H3,(H2,24,25)(H2,26,27,28,29)
NCI pathway
Reactome pathway
n/an/a>5.00E+4n/an/an/an/an/an/a
University of Auckland
Assay Description
IC50 is the inhibitor concentration which inhibits 50% of kinase activity that catalyzes the transfer of the terminal phosphate from [gamma-32P] labe...
J Med Chem 43: 4200-11 (2000)
Article DOI: 10.1021/jm000161d
BindingDB Entry DOI: 10.7270/Q2JW8C3G