BDBM4615 1,6-naphthyridine deriv. 17::N-[2-[[(tert-Butylamino)carbonyl]amino]-3-(3,5-dimethoxyphenyl)-1,6-naphthyridin-7-yl]acetamide::N-{2-[(tert-butylcarbamoyl)amino]-3-(3,5-dimethoxyphenyl)-1,6-naphthyridin-7-yl}acetamide
SMILES: COc1cc(OC)cc(c1)-c1cc2cnc(NC(C)=O)cc2nc1NC(=O)NC(C)(C)C
InChI Key: InChIKey=FEFTTWZZDJMATO-UHFFFAOYSA-N
Data: 3 IC50
Activity Spreadsheet -- Enzyme Inhibition Constant Data from BindingDB
Found 3 hits for monomerid = 4615
Trg + Lig
Ki
nM
ΔG°
kcal/mole
IC50
nM
Kd
nM
EC50/IC50
nM
koff
s-1
kon
M-1s-1
pHTemp
°C
Fibroblast growth factor receptor 1
(Homo sapiens (Human))
BDBM4615
(1,6-naphthyridine deriv. 17 | N-[2-[[(tert-Butylam...)
Show SMILES COc1cc(OC)cc(c1)-c1cc2cnc(NC(C)=O)cc2nc1NC(=O)NC(C)(C)C
Show InChI InChI=1S/C23H27N5O4/c1-13(29)25-20-11-19-15(12-24-20)9-18(14-7-16(31-5)10-17(8-14)32-6)21(26-19)27-22(30)28-23(2,3)4/h7-12H,1-6H3,(H,24,25,29)(H2,26,27,28,30)
NCI pathway
Reactome pathway
n/an/a 25n/an/an/an/a7.425
University of Auckland
Assay Description
IC50 is the inhibitor concentration which inhibits 50% of kinase activity that catalyzes the transfer of the terminal phosphate from [gamma-32P] labe...
J Med Chem 43: 4200-11 (2000)
Article DOI: 10.1021/jm000161d
BindingDB Entry DOI: 10.7270/Q2JW8C3G
Proto-oncogene tyrosine-protein kinase Src
(Homo sapiens (Human))
BDBM4615
(1,6-naphthyridine deriv. 17 | N-[2-[[(tert-Butylam...)
Show SMILES COc1cc(OC)cc(c1)-c1cc2cnc(NC(C)=O)cc2nc1NC(=O)NC(C)(C)C
Show InChI InChI=1S/C23H27N5O4/c1-13(29)25-20-11-19-15(12-24-20)9-18(14-7-16(31-5)10-17(8-14)32-6)21(26-19)27-22(30)28-23(2,3)4/h7-12H,1-6H3,(H,24,25,29)(H2,26,27,28,30)
n/an/a 3.80E+3n/an/an/an/an/an/a
University of Auckland
Assay Description
IC50 is the inhibitor concentration which inhibits 50% of kinase activity that catalyzes the transfer of the terminal phosphate from [gamma-32P] labe...
J Med Chem 43: 4200-11 (2000)
Article DOI: 10.1021/jm000161d
BindingDB Entry DOI: 10.7270/Q2JW8C3G
Platelet-derived growth factor receptor beta
(Homo sapiens (Human))
BDBM4615
(1,6-naphthyridine deriv. 17 | N-[2-[[(tert-Butylam...)
Show SMILES COc1cc(OC)cc(c1)-c1cc2cnc(NC(C)=O)cc2nc1NC(=O)NC(C)(C)C
Show InChI InChI=1S/C23H27N5O4/c1-13(29)25-20-11-19-15(12-24-20)9-18(14-7-16(31-5)10-17(8-14)32-6)21(26-19)27-22(30)28-23(2,3)4/h7-12H,1-6H3,(H,24,25,29)(H2,26,27,28,30)
NCI pathway
Reactome pathway
n/an/a 4.70E+3n/an/an/an/an/an/a
University of Auckland
Assay Description
IC50 is the inhibitor concentration which inhibits 50% of kinase activity that catalyzes the transfer of the terminal phosphate from [gamma-32P] labe...
J Med Chem 43: 4200-11 (2000)
Article DOI: 10.1021/jm000161d
BindingDB Entry DOI: 10.7270/Q2JW8C3G