BDBM4620 Anilinoquinazoline deriv. 3::N-(4-chlorophenyl)-6,7-dimethoxyquinazolin-4-amine
SMILES: COc1cc2ncnc(Nc3ccc(Cl)cc3)c2cc1OC
InChI Key: InChIKey=LHGGYEWCVWOGFX-UHFFFAOYSA-N
Data: 4 IC50
PDB links: 1 PDB ID contains inhibitors having a similarity of 90% to this monomer.
Activity Spreadsheet -- Enzyme Inhibition Constant Data from BindingDB
Found 4 hits for monomerid = 4620
Trg + Lig
Ki
nM
ΔG°
kcal/mole
IC50
nM
Kd
nM
EC50/IC50
nM
koff
s-1
kon
M-1s-1
pHTemp
°C
Vascular endothelial growth factor receptor 1
(Homo sapiens (Human))
BDBM4620
(Anilinoquinazoline deriv. 3 | N-(4-chlorophenyl)-6...)
Show SMILES COc1cc2ncnc(Nc3ccc(Cl)cc3)c2cc1OC
Show InChI InChI=1S/C16H14ClN3O2/c1-21-14-7-12-13(8-15(14)22-2)18-9-19-16(12)20-11-5-3-10(17)4-6-11/h3-9H,1-2H3,(H,18,19,20)
n/an/a 1.10E+4n/an/an/an/a7.422
AstraZeneca
Assay Description
An ELISA assay was used to determine the ability of inhibitor to inhibit VEGF-R RTK activity. The compounds were incubated with enzyme 20 min at room...
J Med Chem 42: 5369-89 (1999)
Article DOI: 10.1021/jm990345w
BindingDB Entry DOI: 10.7270/Q2F47MBM
Vascular endothelial growth factor receptor 2
(Homo sapiens (Human))
BDBM4620
(Anilinoquinazoline deriv. 3 | N-(4-chlorophenyl)-6...)
Show SMILES COc1cc2ncnc(Nc3ccc(Cl)cc3)c2cc1OC
Show InChI InChI=1S/C16H14ClN3O2/c1-21-14-7-12-13(8-15(14)22-2)18-9-19-16(12)20-11-5-3-10(17)4-6-11/h3-9H,1-2H3,(H,18,19,20)
NCI pathway
Reactome pathway
n/an/a 800n/an/an/an/an/an/a
Chaminade University of Honolulu
Curated by ChEMBL
Assay Description
Inhibition of human recombinant His-tagged VEGFR2 assessed as infrared absorption by ELISA assay in presence of 20 uM ATP
Bioorg Med Chem Lett 21: 1371-5 (2011)
Checked by Author
Article DOI: 10.1016/j.bmcl.2011.01.037
BindingDB Entry DOI: 10.7270/Q21J9B1F
Fibroblast growth factor receptor 1
(Homo sapiens (Human))
BDBM4620
(Anilinoquinazoline deriv. 3 | N-(4-chlorophenyl)-6...)
Show SMILES COc1cc2ncnc(Nc3ccc(Cl)cc3)c2cc1OC
Show InChI InChI=1S/C16H14ClN3O2/c1-21-14-7-12-13(8-15(14)22-2)18-9-19-16(12)20-11-5-3-10(17)4-6-11/h3-9H,1-2H3,(H,18,19,20)
NCI pathway
Reactome pathway
n/an/a>1.00E+5n/an/an/an/an/a25
AstraZeneca
Assay Description
An ELISA assay was used to determine the ability of inhibitor to inhibit FGFR-1 TK activity. The compounds were incubated with enzyme 20 min at room ...
J Med Chem 42: 5369-89 (1999)
Article DOI: 10.1021/jm990345w
BindingDB Entry DOI: 10.7270/Q2F47MBM
Vascular endothelial growth factor receptor 2
(Homo sapiens (Human))
BDBM4620
(Anilinoquinazoline deriv. 3 | N-(4-chlorophenyl)-6...)
Show SMILES COc1cc2ncnc(Nc3ccc(Cl)cc3)c2cc1OC
Show InChI InChI=1S/C16H14ClN3O2/c1-21-14-7-12-13(8-15(14)22-2)18-9-19-16(12)20-11-5-3-10(17)4-6-11/h3-9H,1-2H3,(H,18,19,20)
NCI pathway
Reactome pathway
n/an/a 800n/an/an/an/an/a25
AstraZeneca
Assay Description
An ELISA assay was used to determine the ability of inhibitor to inhibit VEGF-R RTK activity. The compounds were incubated with enzyme 20 min at room...
J Med Chem 42: 5369-89 (1999)
Article DOI: 10.1021/jm990345w
BindingDB Entry DOI: 10.7270/Q2F47MBM