BDBM4625 Anilinoquinazoline deriv. 8::N-(2,4-difluorophenyl)-6,7-dimethoxyquinazolin-4-amine
SMILES: COc1cc2ncnc(Nc3ccc(F)cc3F)c2cc1OC
InChI Key: InChIKey=WTKCXIAUFZSYSE-UHFFFAOYSA-N
Data: 3 IC50
Activity Spreadsheet -- Enzyme Inhibition Constant Data from BindingDB
Found 3 hits for monomerid = 4625
Trg + Lig
Ki
nM
ΔG°
kcal/mole
IC50
nM
Kd
nM
EC50/IC50
nM
koff
s-1
kon
M-1s-1
pHTemp
°C
Vascular endothelial growth factor receptor 1
(Homo sapiens (Human))
BDBM4625
(Anilinoquinazoline deriv. 8 | N-(2,4-difluoropheny...)
Show SMILES COc1cc2ncnc(Nc3ccc(F)cc3F)c2cc1OC
Show InChI InChI=1S/C16H13F2N3O2/c1-22-14-6-10-13(7-15(14)23-2)19-8-20-16(10)21-12-4-3-9(17)5-11(12)18/h3-8H,1-2H3,(H,19,20,21)
n/an/a 2.20E+4n/an/an/an/a7.422
AstraZeneca
Assay Description
An ELISA assay was used to determine the ability of inhibitor to inhibit VEGF-R RTK activity. The compounds were incubated with enzyme 20 min at room...
J Med Chem 42: 5369-89 (1999)
Article DOI: 10.1021/jm990345w
BindingDB Entry DOI: 10.7270/Q2F47MBM
Fibroblast growth factor receptor 1
(Homo sapiens (Human))
BDBM4625
(Anilinoquinazoline deriv. 8 | N-(2,4-difluoropheny...)
Show SMILES COc1cc2ncnc(Nc3ccc(F)cc3F)c2cc1OC
Show InChI InChI=1S/C16H13F2N3O2/c1-22-14-6-10-13(7-15(14)23-2)19-8-20-16(10)21-12-4-3-9(17)5-11(12)18/h3-8H,1-2H3,(H,19,20,21)
NCI pathway
Reactome pathway
n/an/a 5.80E+4n/an/an/an/an/a25
AstraZeneca
Assay Description
An ELISA assay was used to determine the ability of inhibitor to inhibit FGFR-1 TK activity. The compounds were incubated with enzyme 20 min at room ...
J Med Chem 42: 5369-89 (1999)
Article DOI: 10.1021/jm990345w
BindingDB Entry DOI: 10.7270/Q2F47MBM
Vascular endothelial growth factor receptor 2
(Homo sapiens (Human))
BDBM4625
(Anilinoquinazoline deriv. 8 | N-(2,4-difluoropheny...)
Show SMILES COc1cc2ncnc(Nc3ccc(F)cc3F)c2cc1OC
Show InChI InChI=1S/C16H13F2N3O2/c1-22-14-6-10-13(7-15(14)23-2)19-8-20-16(10)21-12-4-3-9(17)5-11(12)18/h3-8H,1-2H3,(H,19,20,21)
NCI pathway
Reactome pathway
n/an/a 2.90E+3n/an/an/an/an/a25
AstraZeneca
Assay Description
An ELISA assay was used to determine the ability of inhibitor to inhibit VEGF-R RTK activity. The compounds were incubated with enzyme 20 min at room...
J Med Chem 42: 5369-89 (1999)
Article DOI: 10.1021/jm990345w
BindingDB Entry DOI: 10.7270/Q2F47MBM