BDBM46250 (4E)-2-methoxy-4-[(pentan-3-ylamino)-sulfanyl-methylidene]cyclohexa-2,5-dien-1-one::(4E)-2-methoxy-4-[(pentan-3-ylamino)-sulfanylmethylidene]cyclohexa-2,5-dien-1-one::(4E)-4-[(1-ethylpropylamino)-mercapto-methylene]-2-methoxy-cyclohexa-2,5-dien-1-one::(4E)-4-[mercapto-(pentan-3-ylamino)methylidene]-2-methoxy-1-cyclohexa-2,5-dienone::MLS-0412118.0001::cid_44182131
SMILES: CCC(CC)NC(=S)c1ccc(O)c(OC)c1
InChI Key: InChIKey=YYNIOAPYKHRKHV-UHFFFAOYSA-N
Data: 5 IC50
Activity Spreadsheet -- Enzyme Inhibition Constant Data from BindingDB
Found 5 hits for monomerid = 46250
Trg + Lig
Ki
nM
ΔG°
kcal/mole
IC50
nM
Kd
nM
EC50/IC50
nM
koff
s-1
kon
M-1s-1
pHTemp
°C
Hematopoietic protein-tyrosine phosphatase (HEPTP)
(Homo sapiens (Human))
BDBM46250
((4E)-2-methoxy-4-[(pentan-3-ylamino)-sulfanyl-meth...)
Show SMILES CCC(CC)NC(=S)c1ccc(O)c(OC)c1
Show InChI InChI=1S/C13H19NO2S/c1-4-10(5-2)14-13(17)9-6-7-11(15)12(8-9)16-3/h6-8,10,15H,4-5H2,1-3H3,(H,14,17)
PCBioAssay
n/an/a 8.12E+4n/an/an/an/an/an/a
Burnham Center for Chemical Genomics
Curated by PubChem BioAssay
Assay Description
Data Source: Sanford-Burnham Center for Chemical Genomics (SBCCG) Source Affiliation: Sanford-Burnham Medical Research Institute (SBMRI, San Diego, C...
PubChem Bioassay (2009)
BindingDB Entry DOI: 10.7270/Q2474894
Dual specificity protein phosphatase (VHR)
(Homo sapiens (Human))
BDBM46250
((4E)-2-methoxy-4-[(pentan-3-ylamino)-sulfanyl-meth...)
Show SMILES CCC(CC)NC(=S)c1ccc(O)c(OC)c1
Show InChI InChI=1S/C13H19NO2S/c1-4-10(5-2)14-13(17)9-6-7-11(15)12(8-9)16-3/h6-8,10,15H,4-5H2,1-3H3,(H,14,17)
Reactome pathway
PCBioAssay
n/an/a 1.83E+4n/an/an/an/an/an/a
Burnham Center for Chemical Genomics
Curated by PubChem BioAssay
Assay Description
Data Source: Sanford-Burnham Center for Chemical Genomics (SBCCG) Source Affiliation: Sanford-Burnham Medical Research Institute (SBMRI, San Diego, C...
PubChem Bioassay (2009)
BindingDB Entry DOI: 10.7270/Q2DB807Z
Dual specificity protein phosphatase (VHR)
(Homo sapiens (Human))
BDBM46250
((4E)-2-methoxy-4-[(pentan-3-ylamino)-sulfanyl-meth...)
Show SMILES CCC(CC)NC(=S)c1ccc(O)c(OC)c1
Show InChI InChI=1S/C13H19NO2S/c1-4-10(5-2)14-13(17)9-6-7-11(15)12(8-9)16-3/h6-8,10,15H,4-5H2,1-3H3,(H,14,17)
Reactome pathway
PCBioAssay
n/an/a 1.71E+3n/an/an/an/an/an/a
Burnham Center for Chemical Genomics
Curated by PubChem BioAssay
Assay Description
Data Source: Sanford-Burnham Center for Chemical Genomics (SBCCG) Source Affiliation: Sanford-Burnham Medical Research Institute (SBMRI, San Diego, C...
PubChem Bioassay (2009)
BindingDB Entry DOI: 10.7270/Q2WW7G20
Hematopoietic protein-tyrosine phosphatase (HEPTP)
(Homo sapiens (Human))
BDBM46250
((4E)-2-methoxy-4-[(pentan-3-ylamino)-sulfanyl-meth...)
Show SMILES CCC(CC)NC(=S)c1ccc(O)c(OC)c1
Show InChI InChI=1S/C13H19NO2S/c1-4-10(5-2)14-13(17)9-6-7-11(15)12(8-9)16-3/h6-8,10,15H,4-5H2,1-3H3,(H,14,17)
PCBioAssay
n/an/a 766n/an/an/an/an/an/a
Burnham Center for Chemical Genomics
Curated by PubChem BioAssay
Assay Description
Data Source: Sanford-Burnham Center for Chemical Genomics (SBCCG) Source Affiliation: Sanford-Burnham Medical Research Institute (SBMRI, San Diego, C...
PubChem Bioassay (2009)
BindingDB Entry DOI: 10.7270/Q21N7ZJW
Dual specificity protein phosphatase (VHR)
(Homo sapiens (Human))
BDBM46250
((4E)-2-methoxy-4-[(pentan-3-ylamino)-sulfanyl-meth...)
Show SMILES CCC(CC)NC(=S)c1ccc(O)c(OC)c1
Show InChI InChI=1S/C13H19NO2S/c1-4-10(5-2)14-13(17)9-6-7-11(15)12(8-9)16-3/h6-8,10,15H,4-5H2,1-3H3,(H,14,17)
Reactome pathway
PCBioAssay
n/an/a 4.00E+4n/an/an/an/an/an/a
Burnham Center for Chemical Genomics
Curated by PubChem BioAssay
Assay Description
Data Source: Sanford-Burnham Center for Chemical Genomics (SBCCG) Source Affiliation: Sanford-Burnham Medical Research Institute (SBMRI, San Diego, C...
PubChem Bioassay (2009)
BindingDB Entry DOI: 10.7270/Q28K77H7