null
SMILES: COCCOc1cc2nccc(Nc3ccc(Cl)cc3F)c2cc1OC
InChI Key: InChIKey=RJJKXXSFIZEAMB-UHFFFAOYSA-N
Activity Spreadsheet -- Enzyme Inhibition Constant Data from BindingDB
Found 3 hits for monomerid = 4634
Trg + Lig
Ki
nM
ΔG°
kcal/mole
IC50
nM
Kd
nM
EC50/IC50
nM
koff
s-1
kon
M-1s-1
pHTemp
°C
Vascular endothelial growth factor receptor 1
(Homo sapiens (Human))
BDBM4634
(Anilinoquinoline deriv. 17 | N-(4-chloro-2-fluorop...)
Show SMILES COCCOc1cc2nccc(Nc3ccc(Cl)cc3F)c2cc1OC
Show InChI InChI=1S/C19H18ClFN2O3/c1-24-7-8-26-19-11-17-13(10-18(19)25-2)15(5-6-22-17)23-16-4-3-12(20)9-14(16)21/h3-6,9-11H,7-8H2,1-2H3,(H,22,23)
n/an/a 300n/an/an/an/a7.422
AstraZeneca
Assay Description
An ELISA assay was used to determine the ability of inhibitor to inhibit VEGF-R RTK activity. The compounds were incubated with enzyme 20 min at room...
J Med Chem 42: 5369-89 (1999)
Article DOI: 10.1021/jm990345w
BindingDB Entry DOI: 10.7270/Q2F47MBM
Fibroblast growth factor receptor 1
(Homo sapiens (Human))
BDBM4634
(Anilinoquinoline deriv. 17 | N-(4-chloro-2-fluorop...)
Show SMILES COCCOc1cc2nccc(Nc3ccc(Cl)cc3F)c2cc1OC
Show InChI InChI=1S/C19H18ClFN2O3/c1-24-7-8-26-19-11-17-13(10-18(19)25-2)15(5-6-22-17)23-16-4-3-12(20)9-14(16)21/h3-6,9-11H,7-8H2,1-2H3,(H,22,23)
NCI pathway
Reactome pathway
n/an/a 9.30E+3n/an/an/an/an/a25
AstraZeneca
Assay Description
An ELISA assay was used to determine the ability of inhibitor to inhibit FGFR-1 TK activity. The compounds were incubated with enzyme 20 min at room ...
J Med Chem 42: 5369-89 (1999)
Article DOI: 10.1021/jm990345w
BindingDB Entry DOI: 10.7270/Q2F47MBM
Vascular endothelial growth factor receptor 2
(Homo sapiens (Human))
BDBM4634
(Anilinoquinoline deriv. 17 | N-(4-chloro-2-fluorop...)
Show SMILES COCCOc1cc2nccc(Nc3ccc(Cl)cc3F)c2cc1OC
Show InChI InChI=1S/C19H18ClFN2O3/c1-24-7-8-26-19-11-17-13(10-18(19)25-2)15(5-6-22-17)23-16-4-3-12(20)9-14(16)21/h3-6,9-11H,7-8H2,1-2H3,(H,22,23)
NCI pathway
Reactome pathway
n/an/a 10n/an/an/an/an/a25
AstraZeneca
Assay Description
An ELISA assay was used to determine the ability of inhibitor to inhibit VEGF-R RTK activity. The compounds were incubated with enzyme 20 min at room...
J Med Chem 42: 5369-89 (1999)
Article DOI: 10.1021/jm990345w
BindingDB Entry DOI: 10.7270/Q2F47MBM