BDBM4642 Anilinoquinazoline deriv. 25::N-(4-chloro-2-fluorophenyl)-6-methoxy-7-(thiophen-3-ylmethoxy)quinazolin-4-amine
SMILES: COc1cc2c(Nc3ccc(Cl)cc3F)ncnc2cc1OCc1ccsc1
InChI Key: InChIKey=ORADRWKXLYIOGS-UHFFFAOYSA-N
Data: 3 IC50
Activity Spreadsheet -- Enzyme Inhibition Constant Data from BindingDB
Found 3 hits for monomerid = 4642
Trg + Lig
Ki
nM
ΔG°
kcal/mole
IC50
nM
Kd
nM
EC50/IC50
nM
koff
s-1
kon
M-1s-1
pHTemp
°C
Vascular endothelial growth factor receptor 1
(Homo sapiens (Human))
BDBM4642
(Anilinoquinazoline deriv. 25 | N-(4-chloro-2-fluor...)
Show SMILES COc1cc2c(Nc3ccc(Cl)cc3F)ncnc2cc1OCc1ccsc1
Show InChI InChI=1S/C20H15ClFN3O2S/c1-26-18-7-14-17(8-19(18)27-9-12-4-5-28-10-12)23-11-24-20(14)25-16-3-2-13(21)6-15(16)22/h2-8,10-11H,9H2,1H3,(H,23,24,25)
n/an/a 800n/an/an/an/an/a25
AstraZeneca
Assay Description
An ELISA assay was used to determine the ability of inhibitor to inhibit VEGF-R RTK activity. The compounds were incubated with enzyme 20 min at room...
J Med Chem 42: 5369-89 (1999)
Article DOI: 10.1021/jm990345w
BindingDB Entry DOI: 10.7270/Q2F47MBM
Fibroblast growth factor receptor 1
(Homo sapiens (Human))
BDBM4642
(Anilinoquinazoline deriv. 25 | N-(4-chloro-2-fluor...)
Show SMILES COc1cc2c(Nc3ccc(Cl)cc3F)ncnc2cc1OCc1ccsc1
Show InChI InChI=1S/C20H15ClFN3O2S/c1-26-18-7-14-17(8-19(18)27-9-12-4-5-28-10-12)23-11-24-20(14)25-16-3-2-13(21)6-15(16)22/h2-8,10-11H,9H2,1H3,(H,23,24,25)
NCI pathway
Reactome pathway
n/an/a>5.00E+4n/an/an/an/an/a25
AstraZeneca
Assay Description
An ELISA assay was used to determine the ability of inhibitor to inhibit FGFR-1 TK activity. The compounds were incubated with enzyme 20 min at room ...
J Med Chem 42: 5369-89 (1999)
Article DOI: 10.1021/jm990345w
BindingDB Entry DOI: 10.7270/Q2F47MBM
Vascular endothelial growth factor receptor 2
(Homo sapiens (Human))
BDBM4642
(Anilinoquinazoline deriv. 25 | N-(4-chloro-2-fluor...)
Show SMILES COc1cc2c(Nc3ccc(Cl)cc3F)ncnc2cc1OCc1ccsc1
Show InChI InChI=1S/C20H15ClFN3O2S/c1-26-18-7-14-17(8-19(18)27-9-12-4-5-28-10-12)23-11-24-20(14)25-16-3-2-13(21)6-15(16)22/h2-8,10-11H,9H2,1H3,(H,23,24,25)
NCI pathway
Reactome pathway
n/an/a 8n/an/an/an/an/a25
AstraZeneca
Assay Description
An ELISA assay was used to determine the ability of inhibitor to inhibit VEGF-R RTK activity. The compounds were incubated with enzyme 20 min at room...
J Med Chem 42: 5369-89 (1999)
Article DOI: 10.1021/jm990345w
BindingDB Entry DOI: 10.7270/Q2F47MBM