BDBM46441 1-(6-amino-1,3-benzodioxol-5-yl)ethanone::1-(6-azanyl-1,3-benzodioxol-5-yl)ethanone::MLS000037536::SMR000035343::cid_120000
SMILES: CC(=O)c1cc2OCOc2cc1N
InChI Key: InChIKey=DWTHYSZSRJOMSC-UHFFFAOYSA-N
Data: 2 EC50
Activity Spreadsheet -- Enzyme Inhibition Constant Data from BindingDB
Found 2 hits for monomerid = 46441
Trg + Lig
Ki
nM
ΔG°
kcal/mole
IC50
nM
Kd
nM
EC50/IC50
nM
koff
s-1
kon
M-1s-1
pHTemp
°C
Eukaryotic translation initiation factor 2-alpha kinase 3
(Homo sapiens (Human))
BDBM46441
(1-(6-amino-1,3-benzodioxol-5-yl)ethanone | 1-(6-az...)
Show SMILES CC(=O)c1cc2OCOc2cc1N
Show InChI InChI=1S/C9H9NO3/c1-5(11)6-2-8-9(3-7(6)10)13-4-12-8/h2-3H,4,10H2,1H3
PCBioAssay
n/an/an/an/a>5.57E+4n/an/an/an/a
The Scripps Research Institute Molecular Screening Center
Curated by PubChem BioAssay
Assay Description
Source (MLPCN Center Name): The Scripps Research Institute Molecular Screening Center (SRIMSC) Center Affiliation: The Scripps Research Institute (TS...
PubChem Bioassay (2009)
BindingDB Entry DOI: 10.7270/Q2SQ8XTZ
Eukaryotic translation initiation factor 2-alpha kinase 3
(Homo sapiens (Human))
BDBM46441
(1-(6-amino-1,3-benzodioxol-5-yl)ethanone | 1-(6-az...)
Show SMILES CC(=O)c1cc2OCOc2cc1N
Show InChI InChI=1S/C9H9NO3/c1-5(11)6-2-8-9(3-7(6)10)13-4-12-8/h2-3H,4,10H2,1H3
PCBioAssay
n/an/an/an/a>5.57E+4n/an/an/an/a
The Scripps Research Institute Molecular Screening Center
Curated by PubChem BioAssay
Assay Description
Source (MLPCN Center Name): The Scripps Research Institute Molecular Screening Center (SRIMSC) Center Affiliation: The Scripps Research Institute (TS...
PubChem Bioassay (2009)
BindingDB Entry DOI: 10.7270/Q2XG9PJP