BDBM46450 4-[(3-methyl-6-imidazo[2,1-b]thiazolyl)methylamino]-4-oxobutanoic acid::4-[(3-methylimidazo[2,1-b][1,3]thiazol-6-yl)methylamino]-4-oxidanylidene-butanoic acid::4-[(3-methylimidazo[2,1-b][1,3]thiazol-6-yl)methylamino]-4-oxobutanoic acid::4-keto-4-[(3-methylimidazo[2,1-b]thiazol-6-yl)methylamino]butyric acid::MLS000100419::SMR000016892::cid_5310272
SMILES: Cc1csc2nc(CNC(=O)CCC(O)=O)cn12
InChI Key: InChIKey=SWXVHOMXUBDPGH-UHFFFAOYSA-N
Data: 2 EC50
Activity Spreadsheet -- Enzyme Inhibition Constant Data from BindingDB
Found 2 hits for monomerid = 46450
Trg + Lig
Ki
nM
ΔG°
kcal/mole
IC50
nM
Kd
nM
EC50/IC50
nM
koff
s-1
kon
M-1s-1
pHTemp
°C
Eukaryotic translation initiation factor 2-alpha kinase 3
(Homo sapiens (Human))
BDBM46450
(4-[(3-methyl-6-imidazo[2,1-b]thiazolyl)methylamino...)
Show SMILES Cc1csc2nc(CNC(=O)CCC(O)=O)cn12
Show InChI InChI=1S/C11H13N3O3S/c1-7-6-18-11-13-8(5-14(7)11)4-12-9(15)2-3-10(16)17/h5-6H,2-4H2,1H3,(H,12,15)(H,16,17)
PCBioAssay
n/an/an/an/a>5.57E+4n/an/an/an/a
The Scripps Research Institute Molecular Screening Center
Curated by PubChem BioAssay
Assay Description
Source (MLPCN Center Name): The Scripps Research Institute Molecular Screening Center (SRIMSC) Center Affiliation: The Scripps Research Institute (TS...
PubChem Bioassay (2009)
BindingDB Entry DOI: 10.7270/Q2SQ8XTZ
Eukaryotic translation initiation factor 2-alpha kinase 3
(Homo sapiens (Human))
BDBM46450
(4-[(3-methyl-6-imidazo[2,1-b]thiazolyl)methylamino...)
Show SMILES Cc1csc2nc(CNC(=O)CCC(O)=O)cn12
Show InChI InChI=1S/C11H13N3O3S/c1-7-6-18-11-13-8(5-14(7)11)4-12-9(15)2-3-10(16)17/h5-6H,2-4H2,1H3,(H,12,15)(H,16,17)
PCBioAssay
n/an/an/an/a>5.57E+4n/an/an/an/a
The Scripps Research Institute Molecular Screening Center
Curated by PubChem BioAssay
Assay Description
Source (MLPCN Center Name): The Scripps Research Institute Molecular Screening Center (SRIMSC) Center Affiliation: The Scripps Research Institute (TS...
PubChem Bioassay (2009)
BindingDB Entry DOI: 10.7270/Q2XG9PJP