BDBM46458 3-amino-2-propyl-4(3H)-quinazolinone::3-amino-2-propyl-4-quinazolinone::3-amino-2-propyl-quinazolin-4-one::3-amino-2-propylquinazolin-4-one::3-azanyl-2-propyl-quinazolin-4-one::MLS000534809::SMR000142265::cid_805142
SMILES: CCCc1nc2ccccc2c(=O)n1N
InChI Key: InChIKey=CXGQPWUJPOEWIF-UHFFFAOYSA-N
Data: 2 EC50
Activity Spreadsheet -- Enzyme Inhibition Constant Data from BindingDB
Found 2 hits for monomerid = 46458
Trg + Lig
Ki
nM
ΔG°
kcal/mole
IC50
nM
Kd
nM
EC50/IC50
nM
koff
s-1
kon
M-1s-1
pHTemp
°C
Eukaryotic translation initiation factor 2-alpha kinase 3
(Homo sapiens (Human))
BDBM46458
(3-amino-2-propyl-4(3H)-quinazolinone | 3-amino-2-p...)
Show SMILES CCCc1nc2ccccc2c(=O)n1N
Show InChI InChI=1S/C11H13N3O/c1-2-5-10-13-9-7-4-3-6-8(9)11(15)14(10)12/h3-4,6-7H,2,5,12H2,1H3
PCBioAssay
n/an/an/an/a>5.57E+4n/an/an/an/a
The Scripps Research Institute Molecular Screening Center
Curated by PubChem BioAssay
Assay Description
Source (MLPCN Center Name): The Scripps Research Institute Molecular Screening Center (SRIMSC) Center Affiliation: The Scripps Research Institute (TS...
PubChem Bioassay (2009)
BindingDB Entry DOI: 10.7270/Q2SQ8XTZ
Eukaryotic translation initiation factor 2-alpha kinase 3
(Homo sapiens (Human))
BDBM46458
(3-amino-2-propyl-4(3H)-quinazolinone | 3-amino-2-p...)
Show SMILES CCCc1nc2ccccc2c(=O)n1N
Show InChI InChI=1S/C11H13N3O/c1-2-5-10-13-9-7-4-3-6-8(9)11(15)14(10)12/h3-4,6-7H,2,5,12H2,1H3
PCBioAssay
n/an/an/an/a>5.57E+4n/an/an/an/a
The Scripps Research Institute Molecular Screening Center
Curated by PubChem BioAssay
Assay Description
Source (MLPCN Center Name): The Scripps Research Institute Molecular Screening Center (SRIMSC) Center Affiliation: The Scripps Research Institute (TS...
PubChem Bioassay (2009)
BindingDB Entry DOI: 10.7270/Q2XG9PJP