BDBM46464 5-hydroxy-2-methyl-3-benzofurancarboxylic acid ethyl ester::5-hydroxy-2-methyl-benzofuran-3-carboxylic acid ethyl ester::MLS000530169::SMR000135146::cid_81704::ethyl 2-methyl-5-oxidanyl-1-benzofuran-3-carboxylate::ethyl 5-hydroxy-2-methyl-1-benzofuran-3-carboxylate
SMILES: CCOC(=O)c1c(C)oc2ccc(O)cc12
InChI Key: InChIKey=KSNVFCJUBJUTPF-UHFFFAOYSA-N
Data: 2 EC50
Activity Spreadsheet -- Enzyme Inhibition Constant Data from BindingDB
Found 2 hits for monomerid = 46464
Trg + Lig
Ki
nM
ΔG°
kcal/mole
IC50
nM
Kd
nM
EC50/IC50
nM
koff
s-1
kon
M-1s-1
pHTemp
°C
Eukaryotic translation initiation factor 2-alpha kinase 3
(Homo sapiens (Human))
BDBM46464
(5-hydroxy-2-methyl-3-benzofurancarboxylic acid eth...)
Show SMILES CCOC(=O)c1c(C)oc2ccc(O)cc12
Show InChI InChI=1S/C12H12O4/c1-3-15-12(14)11-7(2)16-10-5-4-8(13)6-9(10)11/h4-6,13H,3H2,1-2H3
PCBioAssay
n/an/an/an/a>5.57E+4n/an/an/an/a
The Scripps Research Institute Molecular Screening Center
Curated by PubChem BioAssay
Assay Description
Source (MLPCN Center Name): The Scripps Research Institute Molecular Screening Center (SRIMSC) Center Affiliation: The Scripps Research Institute (TS...
PubChem Bioassay (2009)
BindingDB Entry DOI: 10.7270/Q2SQ8XTZ
Eukaryotic translation initiation factor 2-alpha kinase 3
(Homo sapiens (Human))
BDBM46464
(5-hydroxy-2-methyl-3-benzofurancarboxylic acid eth...)
Show SMILES CCOC(=O)c1c(C)oc2ccc(O)cc12
Show InChI InChI=1S/C12H12O4/c1-3-15-12(14)11-7(2)16-10-5-4-8(13)6-9(10)11/h4-6,13H,3H2,1-2H3
PCBioAssay
n/an/an/an/a>5.57E+4n/an/an/an/a
The Scripps Research Institute Molecular Screening Center
Curated by PubChem BioAssay
Assay Description
Source (MLPCN Center Name): The Scripps Research Institute Molecular Screening Center (SRIMSC) Center Affiliation: The Scripps Research Institute (TS...
PubChem Bioassay (2009)
BindingDB Entry DOI: 10.7270/Q2XG9PJP