BDBM46630 2-(2-fluorophenyl)-4,6-dinitro-1,2-benzothiazol-3-one::MLS-0315782.0001::cid_4917293
SMILES: [O-][N+](=O)c1cc([N+]([O-])=O)c2c(c1)sn(-c1ccccc1F)c2=O
InChI Key: InChIKey=YBPKUMGHOVSHQK-UHFFFAOYSA-N
Data: 3 IC50
Activity Spreadsheet -- Enzyme Inhibition Constant Data from BindingDB
Found 3 hits for monomerid = 46630
Trg + Lig
Ki
nM
ΔG°
kcal/mole
IC50
nM
Kd
nM
EC50/IC50
nM
koff
s-1
kon
M-1s-1
pHTemp
°C
phosphomannomutase 2
(Homo sapiens (Human))
BDBM46630
(2-(2-fluorophenyl)-4,6-dinitro-1,2-benzothiazol-3-...)
Show SMILES [O-][N+](=O)c1cc([N+]([O-])=O)c2c(c1)sn(-c1ccccc1F)c2=O
Show InChI InChI=1S/C13H6FN3O5S/c14-8-3-1-2-4-9(8)15-13(18)12-10(17(21)22)5-7(16(19)20)6-11(12)23-15/h1-6H
Reactome pathway
PCBioAssay
n/an/a 4.22E+3n/an/an/an/an/an/a
Burnham Center for Chemical Genomics
Curated by PubChem BioAssay
Assay Description
Data Source: Sanford-Burnham Center for Chemical Genomics (SBCCG) Source Affiliation: Sanford-Burnham Medical Research Institute (SBMRI, San Diego, C...
PubChem Bioassay (2010)
BindingDB Entry DOI: 10.7270/Q2CJ8BWC
MPI protein
(Homo sapiens (Human))
BDBM46630
(2-(2-fluorophenyl)-4,6-dinitro-1,2-benzothiazol-3-...)
Show SMILES [O-][N+](=O)c1cc([N+]([O-])=O)c2c(c1)sn(-c1ccccc1F)c2=O
Show InChI InChI=1S/C13H6FN3O5S/c14-8-3-1-2-4-9(8)15-13(18)12-10(17(21)22)5-7(16(19)20)6-11(12)23-15/h1-6H
Reactome pathway
PCBioAssay
n/an/a 1.45E+3n/an/an/an/an/an/a
Burnham Center for Chemical Genomics
Curated by PubChem BioAssay
Assay Description
Data Source: Sanford-Burnham Center for Chemical Genomics (SBCCG) Source Affiliation: Sanford-Burnham Medical Research Institute (SBMRI, San Diego, C...
PubChem Bioassay (2010)
BindingDB Entry DOI: 10.7270/Q2J964TC
phosphatase, orphan 1
(Homo sapiens (Human))
BDBM46630
(2-(2-fluorophenyl)-4,6-dinitro-1,2-benzothiazol-3-...)
Show SMILES [O-][N+](=O)c1cc([N+]([O-])=O)c2c(c1)sn(-c1ccccc1F)c2=O
Show InChI InChI=1S/C13H6FN3O5S/c14-8-3-1-2-4-9(8)15-13(18)12-10(17(21)22)5-7(16(19)20)6-11(12)23-15/h1-6H
PCBioAssay
n/an/a 23.3n/an/an/an/an/an/a
Burnham Center for Chemical Genomics
Curated by PubChem BioAssay
Assay Description
Data Source: Sanford-Burnham Center for Chemical Genomics (SBCCG) Source Affiliation: Sanford-Burnham Medical Research Institute (SBMRI, San Diego, C...
PubChem Bioassay (2010)
BindingDB Entry DOI: 10.7270/Q27S7M52