BDBM46833 (2Z)-2-(1,3-dioxolan-4-ylidene)-N,N,N-trimethylethanaminium::MLS000047708::SMR000033717::[(2Z)-2-(1,3-dioxolan-4-ylidene)ethyl]-trimethyl-ammonium;iodide::[(2Z)-2-(1,3-dioxolan-4-ylidene)ethyl]-trimethyl-azanium;iodide::[(2Z)-2-(1,3-dioxolan-4-ylidene)ethyl]-trimethylammonium;iodide::[(2Z)-2-(1,3-dioxolan-4-ylidene)ethyl]-trimethylazanium;iodide::cid_5771435
SMILES: C[N+](C)(C)C\C=C1\COCO1
InChI Key: InChIKey=SDUNKEQQLQDTTQ-YWEYNIOJSA-N
Data: 3 IC50  2 EC50
Activity Spreadsheet -- Enzyme Inhibition Constant Data from BindingDB
Found 5 hits for monomerid = 46833
Trg + Lig
Ki
nM
ΔG°
kcal/mole
IC50
nM
Kd
nM
EC50/IC50
nM
koff
s-1
kon
M-1s-1
pHTemp
°C
MCOLN3 protein
(Homo sapiens (Human))
BDBM46833
((2Z)-2-(1,3-dioxolan-4-ylidene)-N,N,N-trimethyleth...)
Show SMILES C[N+](C)(C)C\C=C1\COCO1
Show InChI InChI=1S/C8H16NO2/c1-9(2,3)5-4-8-6-10-7-11-8/h4H,5-7H2,1-3H3/q+1/b8-4-
PCBioAssay
n/an/an/an/a 4.76E+3n/an/an/an/a
The Scripps Research Institute Molecular Screening Center
Curated by PubChem BioAssay
Assay Description
Source (MLPCN Center Name): The Scripps Research Institute Molecular Screening Center (SRIMSC) Center Affiliation: The Scripps Research Institute (TS...
PubChem Bioassay (2009)
BindingDB Entry DOI: 10.7270/Q21834W4
transient receptor potential cation channel, subfamily N, member 1
(Danio rerio)
BDBM46833
((2Z)-2-(1,3-dioxolan-4-ylidene)-N,N,N-trimethyleth...)
Show SMILES C[N+](C)(C)C\C=C1\COCO1
Show InChI InChI=1S/C8H16NO2/c1-9(2,3)5-4-8-6-10-7-11-8/h4H,5-7H2,1-3H3/q+1/b8-4-
PCBioAssay
n/an/an/an/a 1.76E+4n/an/an/an/a
The Scripps Research Institute Molecular Screening Center
Curated by PubChem BioAssay
Assay Description
Source (MLPCN Center Name): The Scripps Research Institute Molecular Screening Center (SRIMSC) Center Affiliation: The Scripps Research Institute (TS...
PubChem Bioassay (2009)
BindingDB Entry DOI: 10.7270/Q2Z60MG3
Galanin receptor 3
(Homo sapiens (Human))
BDBM46833
((2Z)-2-(1,3-dioxolan-4-ylidene)-N,N,N-trimethyleth...)
Show SMILES C[N+](C)(C)C\C=C1\COCO1
Show InChI InChI=1S/C8H16NO2/c1-9(2,3)5-4-8-6-10-7-11-8/h4H,5-7H2,1-3H3/q+1/b8-4-
Reactome pathway
PCBioAssay
n/an/a>2.99E+4n/an/an/an/an/an/a
The Scripps Research Institute Molecular Screening Center
Curated by PubChem BioAssay
PubChem Bioassay (2013)
BindingDB Entry DOI: 10.7270/Q270802Q
probable DNA dC->dU-editing enzyme APOBEC-3A
(Homo sapiens (Human))
BDBM46833
((2Z)-2-(1,3-dioxolan-4-ylidene)-N,N,N-trimethyleth...)
Show SMILES C[N+](C)(C)C\C=C1\COCO1
Show InChI InChI=1S/C8H16NO2/c1-9(2,3)5-4-8-6-10-7-11-8/h4H,5-7H2,1-3H3/q+1/b8-4-
PCBioAssay
n/an/a 1.89E+3n/an/an/an/an/a25
Burnham Center for Chemical Genomics
Curated by PubChem BioAssay
Assay Description
Data Source: Sanford-Burnham Center for Chemical Genomics (SBCCG) Source Affiliation: Sanford-Burnham Medical Research Institute (SBMRI, San Diego, C...
PubChem Bioassay (2011)
BindingDB Entry DOI: 10.7270/Q24F1P6P
DNA dC->dU-editing enzyme APOBEC-3G
(Homo sapiens (Human))
BDBM46833
((2Z)-2-(1,3-dioxolan-4-ylidene)-N,N,N-trimethyleth...)
Show SMILES C[N+](C)(C)C\C=C1\COCO1
Show InChI InChI=1S/C8H16NO2/c1-9(2,3)5-4-8-6-10-7-11-8/h4H,5-7H2,1-3H3/q+1/b8-4-
PCBioAssay
n/an/a 1.89E+3n/an/an/an/an/a25
Burnham Center for Chemical Genomics
Curated by PubChem BioAssay
Assay Description
Data Source: Sanford-Burnham Center for Chemical Genomics (SBCCG) Source Affiliation: Sanford-Burnham Medical Research Institute (SBMRI, San Diego, C...
PubChem Bioassay (2011)
BindingDB Entry DOI: 10.7270/Q2862DX0