null
SMILES: COc1ccc(cc1Br)S(=O)(=O)N1CCC(C)CC1
InChI Key: InChIKey=WUFYBGATQFSDDE-UHFFFAOYSA-N
Activity Spreadsheet -- Enzyme Inhibition Constant Data from BindingDB
Found 2 hits for monomerid = 46840
Trg + Lig
Ki
nM
ΔG°
kcal/mole
IC50
nM
Kd
nM
EC50/IC50
nM
koff
s-1
kon
M-1s-1
pHTemp
°C
Ion channel NompC
(Danio rerio)
BDBM46840
(1-(3-bromanyl-4-methoxy-phenyl)sulfonyl-4-methyl-p...)
Show SMILES COc1ccc(cc1Br)S(=O)(=O)N1CCC(C)CC1
Show InChI InChI=1S/C13H18BrNO3S/c1-10-5-7-15(8-6-10)19(16,17)11-3-4-13(18-2)12(14)9-11/h3-4,9-10H,5-8H2,1-2H3
PCBioAssay
n/an/an/an/a 2.99E+4n/an/an/an/a
The Scripps Research Institute Molecular Screening Center
Curated by PubChem BioAssay
Assay Description
Source (MLPCN Center Name): The Scripps Research Institute Molecular Screening Center (SRIMSC) Center Affiliation: The Scripps Research Institute (TS...
PubChem Bioassay (2009)
BindingDB Entry DOI: 10.7270/Q2Z60MG3
Mucolipin-3
(Homo sapiens (Human))
BDBM46840
(1-(3-bromanyl-4-methoxy-phenyl)sulfonyl-4-methyl-p...)
Show SMILES COc1ccc(cc1Br)S(=O)(=O)N1CCC(C)CC1
Show InChI InChI=1S/C13H18BrNO3S/c1-10-5-7-15(8-6-10)19(16,17)11-3-4-13(18-2)12(14)9-11/h3-4,9-10H,5-8H2,1-2H3
PCBioAssay
n/an/an/an/a 1.82E+3n/an/an/an/a
The Scripps Research Institute Molecular Screening Center
Curated by PubChem BioAssay
Assay Description
Source (MLPCN Center Name): The Scripps Research Institute Molecular Screening Center (SRIMSC) Center Affiliation: The Scripps Research Institute (TS...
PubChem Bioassay (2009)
BindingDB Entry DOI: 10.7270/Q21834W4