BDBM47154 US8957074, 81
SMILES: CN(C)C(=O)c1cc2cnc(Nc3ccc(cn3)C(=O)N3CC4CCC(C3)N4)nc2n1[C@H]1CC[C@@H](CC1)C(C)(C)C
InChI Key: InChIKey=WOZPHGMYKYVQOK-CFBZESNVSA-N
Data: 2 IC50
Activity Spreadsheet -- Enzyme Inhibition Constant Data from BindingDB
Found 2 hits for monomerid = 47154
Trg + Lig
Ki
nM
ΔG°
kcal/mole
IC50
nM
Kd
nM
EC50/IC50
nM
koff
s-1
kon
M-1s-1
pHTemp
°C
Cyclin-dependent kinase 1
(Homo sapiens (Human))
BDBM47154
(US8957074, 81)
Show SMILES CN(C)C(=O)c1cc2cnc(Nc3ccc(cn3)C(=O)N3CC4CCC(C3)N4)nc2n1[C@H]1CC[C@@H](CC1)C(C)(C)C |r,wU:31.35,wD:34.42,(9.45,-14.09,;8.68,-12.75,;10.22,-12.75,;7.91,-11.42,;8.68,-10.09,;6.37,-11.42,;5.46,-10.17,;4,-10.65,;2.67,-9.88,;1.33,-10.65,;1.33,-12.19,;-0,-12.96,;-0,-14.5,;1.33,-15.27,;1.33,-16.81,;-0,-17.58,;-1.34,-16.81,;-1.34,-15.27,;-0,-19.12,;-1.34,-19.89,;1.33,-19.89,;2.67,-19.12,;4,-19.89,;2.81,-20.08,;2.14,-21.01,;2.67,-22.2,;1.33,-21.43,;4,-21.43,;2.67,-12.96,;4,-12.19,;5.46,-12.67,;6.05,-13.75,;7.59,-13.75,;8.36,-15.08,;7.59,-16.42,;6.05,-16.42,;5.28,-15.08,;8.36,-17.75,;9.13,-19.08,;9.9,-17.75,;7.96,-19.24,)|
Show InChI InChI=1S/C31H42N8O2/c1-31(2,3)21-7-11-24(12-8-21)39-25(29(41)37(4)5)14-20-16-33-30(36-27(20)39)35-26-13-6-19(15-32-26)28(40)38-17-22-9-10-23(18-38)34-22/h6,13-16,21-24,34H,7-12,17-18H2,1-5H3,(H,32,33,35,36)/t21-,22?,23?,24-
Reactome pathway
US Patent
n/an/a 3.81E+3n/an/an/an/an/a25
Novartis AG
US Patent
Assay Description
A 384-well microtiter IMAP-FP (Molecular Devices Trade Mark Technology) endpoint assay was used for CDK1/cyclin B kinase activity measurements. The s...
US Patent US8957074 (2015)
BindingDB Entry DOI: 10.7270/Q2K0730S
Cyclin-dependent kinase 4
(Homo sapiens (Human))
BDBM47154
(US8957074, 81)
Show SMILES CN(C)C(=O)c1cc2cnc(Nc3ccc(cn3)C(=O)N3CC4CCC(C3)N4)nc2n1[C@H]1CC[C@@H](CC1)C(C)(C)C |r,wU:31.35,wD:34.42,(9.45,-14.09,;8.68,-12.75,;10.22,-12.75,;7.91,-11.42,;8.68,-10.09,;6.37,-11.42,;5.46,-10.17,;4,-10.65,;2.67,-9.88,;1.33,-10.65,;1.33,-12.19,;-0,-12.96,;-0,-14.5,;1.33,-15.27,;1.33,-16.81,;-0,-17.58,;-1.34,-16.81,;-1.34,-15.27,;-0,-19.12,;-1.34,-19.89,;1.33,-19.89,;2.67,-19.12,;4,-19.89,;2.81,-20.08,;2.14,-21.01,;2.67,-22.2,;1.33,-21.43,;4,-21.43,;2.67,-12.96,;4,-12.19,;5.46,-12.67,;6.05,-13.75,;7.59,-13.75,;8.36,-15.08,;7.59,-16.42,;6.05,-16.42,;5.28,-15.08,;8.36,-17.75,;9.13,-19.08,;9.9,-17.75,;7.96,-19.24,)|
Show InChI InChI=1S/C31H42N8O2/c1-31(2,3)21-7-11-24(12-8-21)39-25(29(41)37(4)5)14-20-16-33-30(36-27(20)39)35-26-13-6-19(15-32-26)28(40)38-17-22-9-10-23(18-38)34-22/h6,13-16,21-24,34H,7-12,17-18H2,1-5H3,(H,32,33,35,36)/t21-,22?,23?,24-
NCI pathway
Reactome pathway
US Patent
n/an/a<5n/an/an/an/a7.522
Novartis AG
US Patent
Assay Description
An assay for monitoring CDK4/cyclin D1-catalyzed phosphorylation of pRb at the Ser780 site was performed using TR-FRET in a 384-well format, and was ...
US Patent US8957074 (2015)
BindingDB Entry DOI: 10.7270/Q2K0730S