BDBM47499 1-[(Z)-2-(4-chlorophenyl)ethenyl]-9H-pyrido[3,4-b]indole::1-[(Z)-2-(4-chlorophenyl)vinyl]-9H-beta-carboline::MLS000727871::SMR000306567::cid_5296049
SMILES: Clc1ccc(\C=C/c2nccc3c4ccccc4[nH]c23)cc1
InChI Key: InChIKey=KGBVQPQYROHSDJ-YFHOEESVSA-N
Data: 2 EC50
Activity Spreadsheet -- Enzyme Inhibition Constant Data from BindingDB
Found 2 hits for monomerid = 47499
Trg + Lig
Ki
nM
ΔG°
kcal/mole
IC50
nM
Kd
nM
EC50/IC50
nM
koff
s-1
kon
M-1s-1
pHTemp
°C
Importin subunit alpha-1
(Homo sapiens (Human))
BDBM47499
(1-[(Z)-2-(4-chlorophenyl)ethenyl]-9H-pyrido[3,4-b]...)
Show SMILES Clc1ccc(\C=C/c2nccc3c4ccccc4[nH]c23)cc1
Show InChI InChI=1S/C19H13ClN2/c20-14-8-5-13(6-9-14)7-10-18-19-16(11-12-21-18)15-3-1-2-4-17(15)22-19/h1-12,22H/b10-7-
Reactome pathway
PCBioAssay
n/an/an/an/a 8.61E+3n/an/an/an/a
Broad Institute
Curated by PubChem BioAssay
Assay Description
Keywords: Counterscreen, FRET assay, HTS, YIC probe, Dose response, Assay Overview: This is a fluorescence resonance energy transfer (FRET)-based b...
PubChem Bioassay (2010)
BindingDB Entry DOI: 10.7270/Q280513R
Sphingosine 1-phosphate receptor 1
(Homo sapiens (Human))
BDBM47499
(1-[(Z)-2-(4-chlorophenyl)ethenyl]-9H-pyrido[3,4-b]...)
Show SMILES Clc1ccc(\C=C/c2nccc3c4ccccc4[nH]c23)cc1
Show InChI InChI=1S/C19H13ClN2/c20-14-8-5-13(6-9-14)7-10-18-19-16(11-12-21-18)15-3-1-2-4-17(15)22-19/h1-12,22H/b10-7-
Reactome pathway
PCBioAssay
n/an/an/an/a 2.18E+3n/an/an/an/a
The Scripps Research Institute Molecular Screening Center
Curated by PubChem BioAssay
Assay Description
Source (MLPCN Center Name): The Scripps Research Institute Molecular Screening Center (SRIMSC) Center Affiliation: The Scripps Research Institute (TS...
PubChem Bioassay (2010)
BindingDB Entry DOI: 10.7270/Q2VM49PS