BDBM4760 (3S,4S)-3-[(S)-[butyl(ethyl)carbamoyl](acetamido)methyl]-4-carbamimidamidocyclopentane-1-carboxylic acid::Cyclopentane Amide deriv. 15i
SMILES: [#6]-[#6]-[#6]-[#6]-[#7](-[#6]-[#6])-[#6](=O)-[#6](-[#7]-[#6](-[#6])=O)-[#6@H]-1-[#6]-[#6](-[#6]-[#6@@H]-1\[#7]=[#6](\[#7])-[#7])-[#6](-[#8])=O
InChI Key: InChIKey=VKKSNZSHSIVGSC-QPPOZKHWSA-N
Data: 1 IC50
Activity Spreadsheet -- Enzyme Inhibition Constant Data from BindingDB
Found 1 hit for monomerid = 4760
Trg + Lig
Ki
nM
ΔG°
kcal/mole
IC50
nM
Kd
nM
EC50/IC50
nM
koff
s-1
kon
M-1s-1
pHTemp
°C
Neuraminidase A
(Influenza A virus (N9))
BDBM4760
((3S,4S)-3-[(S)-[butyl(ethyl)carbamoyl](acetamido)m...)
Show SMILES [#6]-[#6]-[#6]-[#6]-[#7](-[#6]-[#6])-[#6](=O)-[#6](-[#7]-[#6](-[#6])=O)-[#6@H]-1-[#6]-[#6](-[#6]-[#6@@H]-1\[#7]=[#6](\[#7])-[#7])-[#6](-[#8])=O |r,w:16.23,9.9|
Show InChI InChI=1S/C17H31N5O4/c1-4-6-7-22(5-2)15(24)14(20-10(3)23)12-8-11(16(25)26)9-13(12)21-17(18)19/h11-14H,4-9H2,1-3H3,(H,20,23)(H,25,26)(H4,18,19,21)/t11?,12-,13-,14?/m0/s1
n/an/a 430n/an/an/an/an/an/a
BioCryst Pharmaceuticals, Inc.
Assay Description
A standard fluorimetric assay was used to measure influenza virus neuraminidase activity. The substrate 2 -(4-methylumbelliferyl)-alpha-D-acetylneura...
J Med Chem 47: 1919-29 (2004)
Article DOI: 10.1021/jm0303406
BindingDB Entry DOI: 10.7270/Q2NP22NH