BDBM4774 (3S,4S)-3-carbamimidamido-4-[(1S)-2-(3,5-dimethylpiperidin-1-yl)-1-acetamido-2-oxoethyl]cyclopentane-1-carboxylic acid::Cyclopentane Amide deriv. 16j
SMILES: [#6]-[#6]-1-[#6]-[#6](-[#6])-[#6]-[#7](-[#6]-1)-[#6](=O)-[#6](-[#7]-[#6](-[#6])=O)-[#6@H]-1-[#6]-[#6](-[#6]-[#6@@H]-1\[#7]=[#6](\[#7])-[#7])-[#6](-[#8])=O
InChI Key: InChIKey=GZZBJWHDLIXNQW-WJJYOEJTSA-N
Data: 2 IC50
Activity Spreadsheet -- Enzyme Inhibition Constant Data from BindingDB
Found 2 hits for monomerid = 4774
Trg + Lig
Ki
nM
ΔG°
kcal/mole
IC50
nM
Kd
nM
EC50/IC50
nM
koff
s-1
kon
M-1s-1
pHTemp
°C
Neuraminidase B
(Influenza B virus (B/Lee/40))
BDBM4774
((3S,4S)-3-carbamimidamido-4-[(1S)-2-(3,5-dimethylp...)
Show SMILES [#6]-[#6]-1-[#6]-[#6](-[#6])-[#6]-[#7](-[#6]-1)-[#6](=O)-[#6](-[#7]-[#6](-[#6])=O)-[#6@H]-1-[#6]-[#6](-[#6]-[#6@@H]-1\[#7]=[#6](\[#7])-[#7])-[#6](-[#8])=O |r,w:17.25,10.11|
Show InChI InChI=1S/C18H31N5O4/c1-9-4-10(2)8-23(7-9)16(25)15(21-11(3)24)13-5-12(17(26)27)6-14(13)22-18(19)20/h9-10,12-15H,4-8H2,1-3H3,(H,21,24)(H,26,27)(H4,19,20,22)/t9?,10?,12?,13-,14-,15?/m0/s1
n/an/a>1.00E+5n/an/an/an/an/an/a
BioCryst Pharmaceuticals, Inc.
Assay Description
A standard fluorimetric assay was used to measure influenza virus neuraminidase activity. The substrate 2 -(4-methylumbelliferyl)-alpha-D-acetylneura...
J Med Chem 47: 1919-29 (2004)
Article DOI: 10.1021/jm0303406
BindingDB Entry DOI: 10.7270/Q2NP22NH
Neuraminidase A
(Influenza A virus (N9))
BDBM4774
((3S,4S)-3-carbamimidamido-4-[(1S)-2-(3,5-dimethylp...)
Show SMILES [#6]-[#6]-1-[#6]-[#6](-[#6])-[#6]-[#7](-[#6]-1)-[#6](=O)-[#6](-[#7]-[#6](-[#6])=O)-[#6@H]-1-[#6]-[#6](-[#6]-[#6@@H]-1\[#7]=[#6](\[#7])-[#7])-[#6](-[#8])=O |r,w:17.25,10.11|
Show InChI InChI=1S/C18H31N5O4/c1-9-4-10(2)8-23(7-9)16(25)15(21-11(3)24)13-5-12(17(26)27)6-14(13)22-18(19)20/h9-10,12-15H,4-8H2,1-3H3,(H,21,24)(H,26,27)(H4,19,20,22)/t9?,10?,12?,13-,14-,15?/m0/s1
n/an/a 3.50E+3n/an/an/an/an/an/a
BioCryst Pharmaceuticals, Inc.
Assay Description
A standard fluorimetric assay was used to measure influenza virus neuraminidase activity. The substrate 2 -(4-methylumbelliferyl)-alpha-D-acetylneura...
J Med Chem 47: 1919-29 (2004)
Article DOI: 10.1021/jm0303406
BindingDB Entry DOI: 10.7270/Q2NP22NH