BDBM47768 MLS000681208::N-[2-(3,5-dimethylphenoxy)ethyl]-3-methoxy-benzamide::N-[2-(3,5-dimethylphenoxy)ethyl]-3-methoxybenzamide::SMR000269463::cid_1562455
SMILES: COc1cccc(c1)C(=O)NCCOc1cc(C)cc(C)c1
InChI Key: InChIKey=LDAHLNAPROTDTG-UHFFFAOYSA-N
Data: 5 EC50
Activity Spreadsheet -- Enzyme Inhibition Constant Data from BindingDB
Found 5 hits for monomerid = 47768
Trg + Lig
Ki
nM
ΔG°
kcal/mole
IC50
nM
Kd
nM
EC50/IC50
nM
koff
s-1
kon
M-1s-1
pHTemp
°C
Regulator of G-protein signaling 8
(Homo sapiens (Human))
BDBM47768
(MLS000681208 | N-[2-(3,5-dimethylphenoxy)ethyl]-3-...)
Show SMILES COc1cccc(c1)C(=O)NCCOc1cc(C)cc(C)c1
Show InChI InChI=1S/C18H21NO3/c1-13-9-14(2)11-17(10-13)22-8-7-19-18(20)15-5-4-6-16(12-15)21-3/h4-6,9-12H,7-8H2,1-3H3,(H,19,20)
Reactome pathway
PCBioAssay
n/an/an/an/a>3.00E+4n/an/an/an/a
NMMLSC
Curated by PubChem BioAssay
Assay Description
University of New Mexico Assay Overview: Assay Support: NIH R21NS057014 HTS to identify small molecule regulators of RGS family protein interaction...
PubChem Bioassay (2009)
BindingDB Entry DOI: 10.7270/Q2TM78JD
RGS7
(Homo sapiens (Human))
BDBM47768
(MLS000681208 | N-[2-(3,5-dimethylphenoxy)ethyl]-3-...)
Show SMILES COc1cccc(c1)C(=O)NCCOc1cc(C)cc(C)c1
Show InChI InChI=1S/C18H21NO3/c1-13-9-14(2)11-17(10-13)22-8-7-19-18(20)15-5-4-6-16(12-15)21-3/h4-6,9-12H,7-8H2,1-3H3,(H,19,20)
PCBioAssay
n/an/an/an/a>3.00E+4n/an/an/an/a
NMMLSC
Curated by PubChem BioAssay
Assay Description
University of New Mexico Assay Overview: Assay Support: NIH R21NS057014 HTS to identify small molecule regulators of RGS family protein interaction...
PubChem Bioassay (2009)
BindingDB Entry DOI: 10.7270/Q2PV6HS7
regulator of G-protein signaling 4
(Homo sapiens (Human))
BDBM47768
(MLS000681208 | N-[2-(3,5-dimethylphenoxy)ethyl]-3-...)
Show SMILES COc1cccc(c1)C(=O)NCCOc1cc(C)cc(C)c1
Show InChI InChI=1S/C18H21NO3/c1-13-9-14(2)11-17(10-13)22-8-7-19-18(20)15-5-4-6-16(12-15)21-3/h4-6,9-12H,7-8H2,1-3H3,(H,19,20)
PCBioAssay
n/an/an/an/a 3.00E+4n/an/an/an/a
NMMLSC
Curated by PubChem BioAssay
Assay Description
University of New Mexico Assay Overview: Assay Support: NIH R21NS057014 HTS to identify small molecule regulators of RGS family protein interaction...
PubChem Bioassay (2009)
BindingDB Entry DOI: 10.7270/Q2F76B0G
regulator of G-protein signalling 16
(Homo sapiens (Human))
BDBM47768
(MLS000681208 | N-[2-(3,5-dimethylphenoxy)ethyl]-3-...)
Show SMILES COc1cccc(c1)C(=O)NCCOc1cc(C)cc(C)c1
Show InChI InChI=1S/C18H21NO3/c1-13-9-14(2)11-17(10-13)22-8-7-19-18(20)15-5-4-6-16(12-15)21-3/h4-6,9-12H,7-8H2,1-3H3,(H,19,20)
PCBioAssay
n/an/an/an/a>3.00E+4n/an/an/an/a
NMMLSC
Curated by PubChem BioAssay
Assay Description
University of New Mexico Assay Overview: Assay Support: NIH R21NS057014 HTS to identify small molecule regulators of RGS family protein interaction...
PubChem Bioassay (2009)
BindingDB Entry DOI: 10.7270/Q2FB51BW
G protein signalling regulator 19
(Homo sapiens (Human))
BDBM47768
(MLS000681208 | N-[2-(3,5-dimethylphenoxy)ethyl]-3-...)
Show SMILES COc1cccc(c1)C(=O)NCCOc1cc(C)cc(C)c1
Show InChI InChI=1S/C18H21NO3/c1-13-9-14(2)11-17(10-13)22-8-7-19-18(20)15-5-4-6-16(12-15)21-3/h4-6,9-12H,7-8H2,1-3H3,(H,19,20)
Reactome pathway
PCBioAssay
n/an/an/an/a>3.00E+4n/an/an/an/a
NMMLSC
Curated by PubChem BioAssay
Assay Description
University of New Mexico Assay Overview: Assay Support: NIH R21NS057014 HTS to identify small molecule regulators of RGS family protein interaction...
PubChem Bioassay (2009)
BindingDB Entry DOI: 10.7270/Q2K35S27