BDBM4785 (2Z)-N-[4-(3-Bromoanilino)-6-pyrido[3,4-d]pyrimidin-6-yl]-3-chloro-2-propenamide::(2Z)-N-{4-[(3-bromophenyl)amino]pyrido[3,4-d]pyrimidin-6-yl}-3-chloroprop-2-enamide::4-Anilinopyrido[3,4-d]pyrimidine 12
SMILES: Cl\C=C/C(=O)Nc1cc2c(Nc3cccc(Br)c3)ncnc2cn1
InChI Key: InChIKey=MNRDWWUGMJRIIM-PLNGDYQASA-N
Data: 1 IC50
Activity Spreadsheet -- Enzyme Inhibition Constant Data from BindingDB
Found 1 hit for monomerid = 4785
Trg + Lig
Ki
nM
ΔG°
kcal/mole
IC50
nM
Kd
nM
EC50/IC50
nM
koff
s-1
kon
M-1s-1
pHTemp
°C
Epidermal growth factor receptor
(Homo sapiens (Human))
BDBM4785
((2Z)-N-[4-(3-Bromoanilino)-6-pyrido[3,4-d]pyrimidi...)
Show SMILES Cl\C=C/C(=O)Nc1cc2c(Nc3cccc(Br)c3)ncnc2cn1
Show InChI InChI=1S/C16H11BrClN5O/c17-10-2-1-3-11(6-10)22-16-12-7-14(23-15(24)4-5-18)19-8-13(12)20-9-21-16/h1-9H,(H,19,23,24)(H,20,21,22)/b5-4-
n/an/a 0.690n/an/an/an/a7.425
University of Auckland
Assay Description
Enzyme assays for IC50 determinations were performed in 96-well filter plates. IC50 is the inhibitor concentration which inhibits 50% of kinase activ...
J Med Chem 44: 429-40 (2001)
Article DOI: 10.1021/jm000372i
BindingDB Entry DOI: 10.7270/Q2HX19WB