BDBM47873 2-chloranyl-N-(1-ethanoylindol-3-yl)-N-(4-nitrophenyl)ethanamide::MLS001029454::N-(1-Acetyl-1H-indol-3-yl)-2-chloro-N-(4-nitro-phenyl)-acetamide::N-(1-acetyl-3-indolyl)-2-chloro-N-(4-nitrophenyl)acetamide::N-(1-acetylindol-3-yl)-2-chloro-N-(4-nitrophenyl)acetamide::SMR000425527::cid_3473830
SMILES: CC(=O)n1cc(N(C(=O)CCl)c2ccc(cc2)[N+]([O-])=O)c2ccccc12
InChI Key: InChIKey=BCTFKVRWPMIDNA-UHFFFAOYSA-N
Data: 4 IC50
Activity Spreadsheet -- Enzyme Inhibition Constant Data from BindingDB
Found 4 hits for monomerid = 47873
Trg + Lig
Ki
nM
ΔG°
kcal/mole
IC50
nM
Kd
nM
EC50/IC50
nM
koff
s-1
kon
M-1s-1
pHTemp
°C
3C-like protease
(Avian infectious bronchitis virus)
BDBM47873
(2-chloranyl-N-(1-ethanoylindol-3-yl)-N-(4-nitrophe...)
Show SMILES CC(=O)n1cc(N(C(=O)CCl)c2ccc(cc2)[N+]([O-])=O)c2ccccc12
Show InChI InChI=1S/C18H14ClN3O4/c1-12(23)20-11-17(15-4-2-3-5-16(15)20)21(18(24)10-19)13-6-8-14(9-7-13)22(25)26/h2-9,11H,10H2,1H3
PCBioAssay
n/an/a 1.08E+4n/an/an/an/an/an/a
The Scripps Research Institute Molecular Screening Center
Curated by PubChem BioAssay
Assay Description
Source (MLPCN Center Name): The Scripps Research Institute Molecular Screening Center (SRIMSC) Center Affiliation: The Scripps Research Institute (TS...
PubChem Bioassay (2009)
BindingDB Entry DOI: 10.7270/Q29K48NM
putative hexokinase HKDC1
(Homo sapiens (Human))
BDBM47873
(2-chloranyl-N-(1-ethanoylindol-3-yl)-N-(4-nitrophe...)
Show SMILES CC(=O)n1cc(N(C(=O)CCl)c2ccc(cc2)[N+]([O-])=O)c2ccccc12
Show InChI InChI=1S/C18H14ClN3O4/c1-12(23)20-11-17(15-4-2-3-5-16(15)20)21(18(24)10-19)13-6-8-14(9-7-13)22(25)26/h2-9,11H,10H2,1H3
PCBioAssay
n/an/a 8.00E+4n/an/an/an/an/an/a
Burnham Center for Chemical Genomics
Curated by PubChem BioAssay
Assay Description
Data Source: Sanford-Burnham Center for Chemical Genomics (SBCCG) Source Affiliation: Sanford-Burnham Medical Research Institute (SBMRI, San Diego, C...
PubChem Bioassay (2011)
BindingDB Entry DOI: 10.7270/Q23F4N3R
putative hexokinase HKDC1
(Homo sapiens (Human))
BDBM47873
(2-chloranyl-N-(1-ethanoylindol-3-yl)-N-(4-nitrophe...)
Show SMILES CC(=O)n1cc(N(C(=O)CCl)c2ccc(cc2)[N+]([O-])=O)c2ccccc12
Show InChI InChI=1S/C18H14ClN3O4/c1-12(23)20-11-17(15-4-2-3-5-16(15)20)21(18(24)10-19)13-6-8-14(9-7-13)22(25)26/h2-9,11H,10H2,1H3
PCBioAssay
n/an/a 2.70E+4n/an/an/an/an/an/a
Burnham Center for Chemical Genomics
Curated by PubChem BioAssay
Assay Description
Data Source: Sanford-Burnham Center for Chemical Genomics (SBCCG) Source Affiliation: Sanford-Burnham Medical Research Institute (SBMRI, San Diego, C...
PubChem Bioassay (2011)
BindingDB Entry DOI: 10.7270/Q2W094D4
DNA recombination protein RecA
(Mycobacterium tuberculosis H37Rv)
BDBM47873
(2-chloranyl-N-(1-ethanoylindol-3-yl)-N-(4-nitrophe...)
Show SMILES CC(=O)n1cc(N(C(=O)CCl)c2ccc(cc2)[N+]([O-])=O)c2ccccc12
Show InChI InChI=1S/C18H14ClN3O4/c1-12(23)20-11-17(15-4-2-3-5-16(15)20)21(18(24)10-19)13-6-8-14(9-7-13)22(25)26/h2-9,11H,10H2,1H3
PCBioAssay
n/an/a 3.24E+3n/an/an/an/an/an/a
Southern Research Specialized Biocontainment Screening Center
Curated by PubChem BioAssay
Assay Description
Southern Research's Specialized Biocontainment Screening Center (SRSBSC) Southern Research Institute (Birmingham, Alabama) NIH Molecular Librarie...
PubChem Bioassay (2010)
BindingDB Entry DOI: 10.7270/Q26H4FW6