BDBM47901 (5E)-1-(2-fluorophenyl)-5-(1H-indol-3-ylmethylene)barbituric acid::(5E)-1-(2-fluorophenyl)-5-(1H-indol-3-ylmethylene)pyrimidine-2,4,6(1H,3H,5H)-trione::(5E)-1-(2-fluorophenyl)-5-(1H-indol-3-ylmethylidene)-1,3-diazinane-2,4,6-trione::MLS001197204::SMR000555409::cid_5291609
SMILES: Fc1ccccc1N1C(=O)NC(=O)C(=Cc2c[nH]c3ccccc23)C1=O
InChI Key: InChIKey=BTXWOQBYISISBP-UHFFFAOYSA-N
Data: 1 IC50
Activity Spreadsheet -- Enzyme Inhibition Constant Data from BindingDB
Found 1 hit for monomerid = 47901
Trg + Lig
Ki
nM
ΔG°
kcal/mole
IC50
nM
Kd
nM
EC50/IC50
nM
koff
s-1
kon
M-1s-1
pHTemp
°C
3C-like protease
(Avian infectious bronchitis virus)
BDBM47901
((5E)-1-(2-fluorophenyl)-5-(1H-indol-3-ylmethylene)...)
Show SMILES Fc1ccccc1N1C(=O)NC(=O)C(=Cc2c[nH]c3ccccc23)C1=O |w:14.15|
Show InChI InChI=1S/C19H12FN3O3/c20-14-6-2-4-8-16(14)23-18(25)13(17(24)22-19(23)26)9-11-10-21-15-7-3-1-5-12(11)15/h1-10,21H,(H,22,24,26)
PCBioAssay
n/an/a 9.47E+3n/an/an/an/an/an/a
The Scripps Research Institute Molecular Screening Center
Curated by PubChem BioAssay
Assay Description
Source (MLPCN Center Name): The Scripps Research Institute Molecular Screening Center (SRIMSC) Center Affiliation: The Scripps Research Institute (TS...
PubChem Bioassay (2009)
BindingDB Entry DOI: 10.7270/Q29K48NM