BDBM47950 2-[3-(2-methoxy-4-methyl-phenoxy)propoxy]benzoic acid methyl ester::2-[3-(2-methoxy-4-methylphenoxy)propoxy]benzoic acid methyl ester::MLS000572911::SMR000195218::cid_2285764::methyl 2-[3-(2-methoxy-4-methyl-phenoxy)propoxy]benzoate::methyl 2-[3-(2-methoxy-4-methylphenoxy)propoxy]benzoate
SMILES: COC(=O)c1ccccc1OCCCOc1ccc(C)cc1OC
InChI Key: InChIKey=HMEQYHVBFBFYHM-UHFFFAOYSA-N
Data: 1 IC50
Activity Spreadsheet -- Enzyme Inhibition Constant Data from BindingDB
Found 1 hit for monomerid = 47950
Trg + Lig
Ki
nM
ΔG°
kcal/mole
IC50
nM
Kd
nM
EC50/IC50
nM
koff
s-1
kon
M-1s-1
pHTemp
°C
Heat shock protein HSP 90-alpha
(Homo sapiens (Human))
BDBM47950
(2-[3-(2-methoxy-4-methyl-phenoxy)propoxy]benzoic a...)
Show SMILES COC(=O)c1ccccc1OCCCOc1ccc(C)cc1OC
Show InChI InChI=1S/C19H22O5/c1-14-9-10-17(18(13-14)21-2)24-12-6-11-23-16-8-5-4-7-15(16)19(20)22-3/h4-5,7-10,13H,6,11-12H2,1-3H3
NCI pathway
Reactome pathway
PCBioAssay
n/an/a 4.05n/an/an/an/an/an/a
The Scripps Research Institute Molecular Screening Center
Curated by PubChem BioAssay
Assay Description
Source (MLPCN Center Name): The Scripps Research Institute Molecular Screening Center (SRIMSC) Center Affiliation: The Scripps Research Institute (TS...
PubChem Bioassay (2009)
BindingDB Entry DOI: 10.7270/Q25T3HXW