BDBM4801 (2E)-N-{4-[(3-bromophenyl)amino]pyrido[3,4-d]pyrimidin-6-yl}-N'-[3-(morpholin-4-yl)propyl]but-2-enediamide::(2E)-N1-[4-(3-Bromoanilino)pyrido[3,4-d]pyrimidin-6-yl]-N4-[3-(4-morpholinyl)propyl]-2-butenediamide::4-Anilinopyrido[3,4-d]pyrimidine 28
SMILES: Brc1cccc(Nc2ncnc3cnc(NC(=O)\C=C\C(=O)NCCCN4CCOCC4)cc23)c1
InChI Key: InChIKey=JPHMUYSWHKPNKF-AATRIKPKSA-N
Data: 1 IC50
Activity Spreadsheet -- Enzyme Inhibition Constant Data from BindingDB
Found 1 hit for monomerid = 4801
Trg + Lig
Ki
nM
ΔG°
kcal/mole
IC50
nM
Kd
nM
EC50/IC50
nM
koff
s-1
kon
M-1s-1
pHTemp
°C
Epidermal growth factor receptor
(Homo sapiens (Human))
BDBM4801
((2E)-N-{4-[(3-bromophenyl)amino]pyrido[3,4-d]pyrim...)
Show SMILES Brc1cccc(Nc2ncnc3cnc(NC(=O)\C=C\C(=O)NCCCN4CCOCC4)cc23)c1
Show InChI InChI=1S/C24H26BrN7O3/c25-17-3-1-4-18(13-17)30-24-19-14-21(27-15-20(19)28-16-29-24)31-23(34)6-5-22(33)26-7-2-8-32-9-11-35-12-10-32/h1,3-6,13-16H,2,7-12H2,(H,26,33)(H,27,31,34)(H,28,29,30)/b6-5+
n/an/a 0.810n/an/an/an/an/an/a
University of Auckland
Assay Description
Enzyme assays for IC50 determinations were performed in 96-well filter plates. IC50 is the inhibitor concentration which inhibits 50% of kinase activ...
J Med Chem 44: 429-40 (2001)
Article DOI: 10.1021/jm000372i
BindingDB Entry DOI: 10.7270/Q2HX19WB