BDBM4802 (2E)-N-{4-[(3-bromophenyl)amino]pyrido[3,4-d]pyrimidin-6-yl}-N'-[3-(1H-imidazol-1-yl)propyl]but-2-enediamide::(2E)-N1-[4-(3-Bromoanilino)pyrido[3,4-d]pyrimidin-6-yl]-N4-[3-(1H-imidazol-1-yl)propyl]-2-butenediamide::4-Anilinopyrido[3,4-d]pyrimidine 29
SMILES: Brc1cccc(Nc2ncnc3cnc(NC(=O)\C=C\C(=O)NCCCn4ccnc4)cc23)c1
InChI Key: InChIKey=RCQQOUGGIYVAKT-AATRIKPKSA-N
Data: 1 IC50
Activity Spreadsheet -- Enzyme Inhibition Constant Data from BindingDB
Found 1 hit for monomerid = 4802
Trg + Lig
Ki
nM
ΔG°
kcal/mole
IC50
nM
Kd
nM
EC50/IC50
nM
koff
s-1
kon
M-1s-1
pHTemp
°C
Epidermal growth factor receptor
(Homo sapiens (Human))
BDBM4802
((2E)-N-{4-[(3-bromophenyl)amino]pyrido[3,4-d]pyrim...)
Show SMILES Brc1cccc(Nc2ncnc3cnc(NC(=O)\C=C\C(=O)NCCCn4ccnc4)cc23)c1
Show InChI InChI=1S/C23H21BrN8O2/c24-16-3-1-4-17(11-16)30-23-18-12-20(27-13-19(18)28-14-29-23)31-22(34)6-5-21(33)26-7-2-9-32-10-8-25-15-32/h1,3-6,8,10-15H,2,7,9H2,(H,26,33)(H,27,31,34)(H,28,29,30)/b6-5+
n/an/a 0.560n/an/an/an/an/an/a
University of Auckland
Assay Description
Enzyme assays for IC50 determinations were performed in 96-well filter plates. IC50 is the inhibitor concentration which inhibits 50% of kinase activ...
J Med Chem 44: 429-40 (2001)
Article DOI: 10.1021/jm000372i
BindingDB Entry DOI: 10.7270/Q2HX19WB