null
SMILES: Fc1ccc(Nc2ncnc3cnc(NC(=O)\C=C\C(=O)NCCCN4CCOCC4)cc23)cc1Cl
InChI Key: InChIKey=KNXXEFGLJICDBL-SNAWJCMRSA-N
Activity Spreadsheet -- Enzyme Inhibition Constant Data from BindingDB
Found 1 hit for monomerid = 4804
Trg + Lig
Ki
nM
ΔG°
kcal/mole
IC50
nM
Kd
nM
EC50/IC50
nM
koff
s-1
kon
M-1s-1
pHTemp
°C
Epidermal growth factor receptor
(Homo sapiens (Human))
BDBM4804
((2E)-N-{4-[(3-chloro-4-fluorophenyl)amino]pyrido[3...)
Show SMILES Fc1ccc(Nc2ncnc3cnc(NC(=O)\C=C\C(=O)NCCCN4CCOCC4)cc23)cc1Cl
Show InChI InChI=1S/C24H25ClFN7O3/c25-18-12-16(2-3-19(18)26)31-24-17-13-21(28-14-20(17)29-15-30-24)32-23(35)5-4-22(34)27-6-1-7-33-8-10-36-11-9-33/h2-5,12-15H,1,6-11H2,(H,27,34)(H,28,32,35)(H,29,30,31)/b5-4+
n/an/a 0.610n/an/an/an/an/an/a
University of Auckland
Assay Description
Enzyme assays for IC50 determinations were performed in 96-well filter plates. IC50 is the inhibitor concentration which inhibits 50% of kinase activ...
J Med Chem 44: 429-40 (2001)
Article DOI: 10.1021/jm000372i
BindingDB Entry DOI: 10.7270/Q2HX19WB