null
SMILES: Brc1cccc(Nc2ncnc3cnc(NS(=O)(=O)C=C)cc23)c1
InChI Key: InChIKey=DECUBVXBHCLQNY-UHFFFAOYSA-N
Activity Spreadsheet -- Enzyme Inhibition Constant Data from BindingDB
Found 1 hit for monomerid = 4805
Trg + Lig
Ki
nM
ΔG°
kcal/mole
IC50
nM
Kd
nM
EC50/IC50
nM
koff
s-1
kon
M-1s-1
pHTemp
°C
Epidermal growth factor receptor
(Homo sapiens (Human))
BDBM4805
(4-Anilinopyrido[3,4-d]pyrimidine 32 | N-[4-(3-Brom...)
Show SMILES Brc1cccc(Nc2ncnc3cnc(NS(=O)(=O)C=C)cc23)c1
Show InChI InChI=1S/C15H12BrN5O2S/c1-2-24(22,23)21-14-7-12-13(8-17-14)18-9-19-15(12)20-11-5-3-4-10(16)6-11/h2-9H,1H2,(H,17,21)(H,18,19,20)
n/an/a 0.760n/an/an/an/an/an/a
University of Auckland
Assay Description
Enzyme assays for IC50 determinations were performed in 96-well filter plates. IC50 is the inhibitor concentration which inhibits 50% of kinase activ...
J Med Chem 44: 429-40 (2001)
Article DOI: 10.1021/jm000372i
BindingDB Entry DOI: 10.7270/Q2HX19WB