null
SMILES: Cc1ccoc1C(=O)Nc1ccc(CC(O)=O)cc1
InChI Key: InChIKey=VERAUCCGLBLTGA-UHFFFAOYSA-N
Activity Spreadsheet -- Enzyme Inhibition Constant Data from BindingDB
Found 2 hits for monomerid = 48209
Trg + Lig
Ki
nM
ΔG°
kcal/mole
IC50
nM
Kd
nM
EC50/IC50
nM
koff
s-1
kon
M-1s-1
pHTemp
°C
Endothelial PAS domain-containing protein 1
(Homo sapiens (Human))
BDBM48209
(2-[4-[(3-methyl-2-furoyl)amino]phenyl]acetic acid ...)
Show SMILES Cc1ccoc1C(=O)Nc1ccc(CC(O)=O)cc1
Show InChI InChI=1S/C14H13NO4/c1-9-6-7-19-13(9)14(18)15-11-4-2-10(3-5-11)8-12(16)17/h2-7H,8H2,1H3,(H,15,18)(H,16,17)
Reactome pathway
PCBioAssay
n/an/a 374n/an/an/an/an/an/a
Burnham Center for Chemical Genomics
Curated by PubChem BioAssay
PubChem Bioassay (2012)
BindingDB Entry DOI: 10.7270/Q2WS8RVZ
Matrix metalloproteinase-14 [1-36]
(Homo sapiens (Human))
BDBM48209
(2-[4-[(3-methyl-2-furoyl)amino]phenyl]acetic acid ...)
Show SMILES Cc1ccoc1C(=O)Nc1ccc(CC(O)=O)cc1
Show InChI InChI=1S/C14H13NO4/c1-9-6-7-19-13(9)14(18)15-11-4-2-10(3-5-11)8-12(16)17/h2-7H,8H2,1H3,(H,15,18)(H,16,17)
PCBioAssay
n/an/an/an/a 420n/an/an/an/a
Sanford-Burnham Center for Chemical Genomics
Curated by PubChem BioAssay
Assay Description
Data Source: Sanford-Burnham Center for Chemical Genomics (SBCCG) Source Affiliation: Sanford-Burnham Medical Research Institute (SBMRI, San Diego, C...
PubChem Bioassay (2008)
BindingDB Entry DOI: 10.7270/Q2154FGT