BDBM4821 5-{[(3Z)-5-fluoro-2-oxo-2,3-dihydro-1H-indol-3-ylidene]methyl}-2,4-dimethyl-N-(pyridin-4-ylmethyl)-1H-pyrrole-3-carboxamide::SU11248 analog 12i
SMILES: Cc1[nH]c(\C=C2/C(=O)Nc3ccc(F)cc23)c(C)c1C(=O)NCc1ccncc1
InChI Key: InChIKey=DIKCCHQBRVVDJR-YVLHZVERSA-N
Data: 4 IC50
Activity Spreadsheet -- Enzyme Inhibition Constant Data from BindingDB
Found 4 hits for monomerid = 4821
Trg + Lig
Ki
nM
ΔG°
kcal/mole
IC50
nM
Kd
nM
EC50/IC50
nM
koff
s-1
kon
M-1s-1
pHTemp
°C
Vascular endothelial growth factor receptor 2
(Homo sapiens (Human))
BDBM4821
(5-{[(3Z)-5-fluoro-2-oxo-2,3-dihydro-1H-indol-3-yli...)
Show SMILES Cc1[nH]c(\C=C2/C(=O)Nc3ccc(F)cc23)c(C)c1C(=O)NCc1ccncc1
Show InChI InChI=1S/C22H19FN4O2/c1-12-19(10-17-16-9-15(23)3-4-18(16)27-21(17)28)26-13(2)20(12)22(29)25-11-14-5-7-24-8-6-14/h3-10,26H,11H2,1-2H3,(H,25,29)(H,27,28)/b17-10-
NCI pathway
Reactome pathway
n/an/a<160n/an/an/an/a7.522
SUGEN, Inc.
Assay Description
The assays were performed in 96-well microtiter plates that had been coated with a polyGluTyr peptide. Negative control wells received buffer alone w...
J Med Chem 46: 1116-9 (2003)
Article DOI: 10.1021/jm0204183
BindingDB Entry DOI: 10.7270/Q2D50K5B
Epidermal growth factor receptor
(Homo sapiens (Human))
BDBM4821
(5-{[(3Z)-5-fluoro-2-oxo-2,3-dihydro-1H-indol-3-yli...)
Show SMILES Cc1[nH]c(\C=C2/C(=O)Nc3ccc(F)cc23)c(C)c1C(=O)NCc1ccncc1
Show InChI InChI=1S/C22H19FN4O2/c1-12-19(10-17-16-9-15(23)3-4-18(16)27-21(17)28)26-13(2)20(12)22(29)25-11-14-5-7-24-8-6-14/h3-10,26H,11H2,1-2H3,(H,25,29)(H,27,28)/b17-10-
n/an/a>2.00E+4n/an/an/an/an/an/a
SUGEN, Inc.
Assay Description
IC50 is the inhibitor concentration which inhibits 50% of EGF-R or PDGFR-beta kinase autophosphorylation activity. The assay was performed in 96-well...
J Med Chem 46: 1116-9 (2003)
Article DOI: 10.1021/jm0204183
BindingDB Entry DOI: 10.7270/Q2D50K5B
Platelet-derived growth factor receptor beta
(Homo sapiens (Human))
BDBM4821
(5-{[(3Z)-5-fluoro-2-oxo-2,3-dihydro-1H-indol-3-yli...)
Show SMILES Cc1[nH]c(\C=C2/C(=O)Nc3ccc(F)cc23)c(C)c1C(=O)NCc1ccncc1
Show InChI InChI=1S/C22H19FN4O2/c1-12-19(10-17-16-9-15(23)3-4-18(16)27-21(17)28)26-13(2)20(12)22(29)25-11-14-5-7-24-8-6-14/h3-10,26H,11H2,1-2H3,(H,25,29)(H,27,28)/b17-10-
NCI pathway
Reactome pathway
n/an/a 1n/an/an/an/an/an/a
SUGEN, Inc.
Assay Description
IC50 is the inhibitor concentration which inhibits 50% of EGF-R or PDGFR-beta kinase autophosphorylation activity. The assay was performed in 96-well...
J Med Chem 46: 1116-9 (2003)
Article DOI: 10.1021/jm0204183
BindingDB Entry DOI: 10.7270/Q2D50K5B
Fibroblast growth factor receptor 1
(Homo sapiens (Human))
BDBM4821
(5-{[(3Z)-5-fluoro-2-oxo-2,3-dihydro-1H-indol-3-yli...)
Show SMILES Cc1[nH]c(\C=C2/C(=O)Nc3ccc(F)cc23)c(C)c1C(=O)NCc1ccncc1
Show InChI InChI=1S/C22H19FN4O2/c1-12-19(10-17-16-9-15(23)3-4-18(16)27-21(17)28)26-13(2)20(12)22(29)25-11-14-5-7-24-8-6-14/h3-10,26H,11H2,1-2H3,(H,25,29)(H,27,28)/b17-10-
NCI pathway
Reactome pathway
n/an/a 3.10E+3n/an/an/an/an/an/a
SUGEN, Inc.
Assay Description
The assays were performed in 96-well microtiter plates that had been coated with a polyGluTyr peptide. Negative control wells received buffer alone w...
J Med Chem 46: 1116-9 (2003)
Article DOI: 10.1021/jm0204183
BindingDB Entry DOI: 10.7270/Q2D50K5B