BDBM4836 1-[2-amino-6-(3,5-dimethylphenyl)pyrido[2,3-d]pyrimidin-7-yl]-3-tert-butylurea::PD089828 analog 17
SMILES: Cc1cc(C)cc(c1)-c1cc2cnc(N)nc2nc1NC(=O)NC(C)(C)C
InChI Key: InChIKey=OSGFIMXOHVZTAR-UHFFFAOYSA-N
Data: 4 IC50
Activity Spreadsheet -- Enzyme Inhibition Constant Data from BindingDB
Found 4 hits for monomerid = 4836
Trg + Lig
Ki
nM
ΔG°
kcal/mole
IC50
nM
Kd
nM
EC50/IC50
nM
koff
s-1
kon
M-1s-1
pHTemp
°C
Platelet-derived growth factor receptor beta
(Homo sapiens (Human))
BDBM4836
(1-[2-amino-6-(3,5-dimethylphenyl)pyrido[2,3-d]pyri...)
Show SMILES Cc1cc(C)cc(c1)-c1cc2cnc(N)nc2nc1NC(=O)NC(C)(C)C
Show InChI InChI=1S/C20H24N6O/c1-11-6-12(2)8-13(7-11)15-9-14-10-22-18(21)24-16(14)23-17(15)25-19(27)26-20(3,4)5/h6-10H,1-5H3,(H4,21,22,23,24,25,26,27)
NCI pathway
Reactome pathway
n/an/a 5.29E+4n/an/an/an/a7.425
Parke-Davis Pharmaceutical Research
Assay Description
The kinase activity is the enzyme activity that catalyzes the transfer of the terminal phosphate from [gamma-32P] ATP to the poly (E: Y) substrate. N...
Bioorg Med Chem Lett 7: 2415-20 (1997)
Article DOI: 10.1074/jbc.M606873200
BindingDB Entry DOI: 10.7270/Q28C9TF2
PDGFR-beta/Platelet-derived growth factor receptor alpha
(Homo sapiens (Human))
BDBM4836
(1-[2-amino-6-(3,5-dimethylphenyl)pyrido[2,3-d]pyri...)
Show SMILES Cc1cc(C)cc(c1)-c1cc2cnc(N)nc2nc1NC(=O)NC(C)(C)C
Show InChI InChI=1S/C20H24N6O/c1-11-6-12(2)8-13(7-11)15-9-14-10-22-18(21)24-16(14)23-17(15)25-19(27)26-20(3,4)5/h6-10H,1-5H3,(H4,21,22,23,24,25,26,27)
Reactome pathway
n/an/a 5.29E+4n/an/an/an/an/an/a
Parke-Davis Pharmaceutical Research
Assay Description
Inhibitory activity against platelet-derived growth factor receptor
Bioorg Med Chem Lett 7: 2415-20 (1997)
Article DOI: 10.1074/jbc.M606873200
BindingDB Entry DOI: 10.7270/Q28C9TF2
Proto-oncogene tyrosine-protein kinase Src
(Homo sapiens (Human))
BDBM4836
(1-[2-amino-6-(3,5-dimethylphenyl)pyrido[2,3-d]pyri...)
Show SMILES Cc1cc(C)cc(c1)-c1cc2cnc(N)nc2nc1NC(=O)NC(C)(C)C
Show InChI InChI=1S/C20H24N6O/c1-11-6-12(2)8-13(7-11)15-9-14-10-22-18(21)24-16(14)23-17(15)25-19(27)26-20(3,4)5/h6-10H,1-5H3,(H4,21,22,23,24,25,26,27)
n/an/a>5.00E+4n/an/an/an/an/an/a
Parke-Davis Pharmaceutical Research
Assay Description
The kinase activity is the enzyme activity that catalyzes the transfer of the terminal phosphate from [gamma-32P] labeled ATP to the poly (E: Y) subs...
Bioorg Med Chem Lett 7: 2415-20 (1997)
Article DOI: 10.1074/jbc.M606873200
BindingDB Entry DOI: 10.7270/Q28C9TF2
Fibroblast growth factor receptor 1
(Homo sapiens (Human))
BDBM4836
(1-[2-amino-6-(3,5-dimethylphenyl)pyrido[2,3-d]pyri...)
Show SMILES Cc1cc(C)cc(c1)-c1cc2cnc(N)nc2nc1NC(=O)NC(C)(C)C
Show InChI InChI=1S/C20H24N6O/c1-11-6-12(2)8-13(7-11)15-9-14-10-22-18(21)24-16(14)23-17(15)25-19(27)26-20(3,4)5/h6-10H,1-5H3,(H4,21,22,23,24,25,26,27)
NCI pathway
Reactome pathway
n/an/a 1.13E+3n/an/an/an/an/an/a
Parke-Davis Pharmaceutical Research
Assay Description
The kinase activity is the enzyme activity that catalyzes the transfer of the terminal phosphate from [gamma-32P] ATP to the poly (E: Y) substrate. N...
Bioorg Med Chem Lett 7: 2415-20 (1997)
Article DOI: 10.1074/jbc.M606873200
BindingDB Entry DOI: 10.7270/Q28C9TF2