BDBM4843 1-[2-amino-6-(2-methoxyphenyl)pyrido[2,3-d]pyrimidin-7-yl]-3-tert-butylurea::PD089828 analog 24
SMILES: COc1ccccc1-c1cc2cnc(N)nc2nc1NC(=O)NC(C)(C)C
InChI Key: InChIKey=DVOMFFXZBJHQPZ-UHFFFAOYSA-N
Data: 4 IC50
Activity Spreadsheet -- Enzyme Inhibition Constant Data from BindingDB
Found 4 hits for monomerid = 4843
Trg + Lig
Ki
nM
ΔG°
kcal/mole
IC50
nM
Kd
nM
EC50/IC50
nM
koff
s-1
kon
M-1s-1
pHTemp
°C
Platelet-derived growth factor receptor beta
(Homo sapiens (Human))
BDBM4843
(1-[2-amino-6-(2-methoxyphenyl)pyrido[2,3-d]pyrimid...)
Show SMILES COc1ccccc1-c1cc2cnc(N)nc2nc1NC(=O)NC(C)(C)C
Show InChI InChI=1S/C19H22N6O2/c1-19(2,3)25-18(26)24-16-13(12-7-5-6-8-14(12)27-4)9-11-10-21-17(20)23-15(11)22-16/h5-10H,1-4H3,(H4,20,21,22,23,24,25,26)
NCI pathway
Reactome pathway
n/an/a 4.48E+3n/an/an/an/a7.425
Parke-Davis Pharmaceutical Research
Assay Description
The kinase activity is the enzyme activity that catalyzes the transfer of the terminal phosphate from [gamma-32P] ATP to the poly (E: Y) substrate. N...
Bioorg Med Chem Lett 7: 2415-20 (1997)
Article DOI: 10.1074/jbc.M606873200
BindingDB Entry DOI: 10.7270/Q28C9TF2
PDGFR-beta/Platelet-derived growth factor receptor alpha
(Homo sapiens (Human))
BDBM4843
(1-[2-amino-6-(2-methoxyphenyl)pyrido[2,3-d]pyrimid...)
Show SMILES COc1ccccc1-c1cc2cnc(N)nc2nc1NC(=O)NC(C)(C)C
Show InChI InChI=1S/C19H22N6O2/c1-19(2,3)25-18(26)24-16-13(12-7-5-6-8-14(12)27-4)9-11-10-21-17(20)23-15(11)22-16/h5-10H,1-4H3,(H4,20,21,22,23,24,25,26)
Reactome pathway
n/an/a 4.48E+3n/an/an/an/an/an/a
Parke-Davis Pharmaceutical Research
Assay Description
Inhibitory activity against platelet-derived growth factor receptor
Bioorg Med Chem Lett 7: 2415-20 (1997)
Article DOI: 10.1074/jbc.M606873200
BindingDB Entry DOI: 10.7270/Q28C9TF2
Proto-oncogene tyrosine-protein kinase Src
(Homo sapiens (Human))
BDBM4843
(1-[2-amino-6-(2-methoxyphenyl)pyrido[2,3-d]pyrimid...)
Show SMILES COc1ccccc1-c1cc2cnc(N)nc2nc1NC(=O)NC(C)(C)C
Show InChI InChI=1S/C19H22N6O2/c1-19(2,3)25-18(26)24-16-13(12-7-5-6-8-14(12)27-4)9-11-10-21-17(20)23-15(11)22-16/h5-10H,1-4H3,(H4,20,21,22,23,24,25,26)
n/an/a 1.04E+4n/an/an/an/an/an/a
Parke-Davis Pharmaceutical Research
Assay Description
The kinase activity is the enzyme activity that catalyzes the transfer of the terminal phosphate from [gamma-32P] labeled ATP to the poly (E: Y) subs...
Bioorg Med Chem Lett 7: 2415-20 (1997)
Article DOI: 10.1074/jbc.M606873200
BindingDB Entry DOI: 10.7270/Q28C9TF2
Fibroblast growth factor receptor 1
(Homo sapiens (Human))
BDBM4843
(1-[2-amino-6-(2-methoxyphenyl)pyrido[2,3-d]pyrimid...)
Show SMILES COc1ccccc1-c1cc2cnc(N)nc2nc1NC(=O)NC(C)(C)C
Show InChI InChI=1S/C19H22N6O2/c1-19(2,3)25-18(26)24-16-13(12-7-5-6-8-14(12)27-4)9-11-10-21-17(20)23-15(11)22-16/h5-10H,1-4H3,(H4,20,21,22,23,24,25,26)
NCI pathway
Reactome pathway
n/an/a 1.12E+4n/an/an/an/an/an/a
Parke-Davis Pharmaceutical Research
Assay Description
The kinase activity is the enzyme activity that catalyzes the transfer of the terminal phosphate from [gamma-32P] labeled ATP to the poly (E: Y) subs...
Bioorg Med Chem Lett 7: 2415-20 (1997)
Article DOI: 10.1074/jbc.M606873200
BindingDB Entry DOI: 10.7270/Q28C9TF2