BDBM48455 4-(2-Methyl-thiazol-4-yl)-benzene-1,2-diol::4-(2-methyl-1,3-thiazol-4-yl)benzene-1,2-diol::4-(2-methyl-4-thiazolyl)benzene-1,2-diol::4-(2-methylthiazol-4-yl)pyrocatechol::MLS000067705::SMR000125075::cid_849783
SMILES: Cc1nc(cs1)-c1ccc(O)c(O)c1
InChI Key: InChIKey=NAJCJNKRIQETEO-UHFFFAOYSA-N
Data: 5 IC50  2 EC50
Activity Spreadsheet -- Enzyme Inhibition Constant Data from BindingDB
Found 7 hits for monomerid = 48455
Trg + Lig
Ki
nM
ΔG°
kcal/mole
IC50
nM
Kd
nM
EC50/IC50
nM
koff
s-1
kon
M-1s-1
pHTemp
°C
Estradiol receptor beta (ERβ)
(Homo sapiens (Human))
BDBM48455
(4-(2-Methyl-thiazol-4-yl)-benzene-1,2-diol | 4-(2-...)
Show SMILES Cc1nc(cs1)-c1ccc(O)c(O)c1
Show InChI InChI=1S/C10H9NO2S/c1-6-11-8(5-14-6)7-2-3-9(12)10(13)4-7/h2-5,12-13H,1H3
PCBioAssay
n/an/a 8.73E+4n/an/an/an/an/an/a
Emory University Molecular Libraries Screening Center
Curated by PubChem BioAssay
Assay Description
NIH Molecular Libraries Screening Centers Network [MLSCN] Emory Chemical Biology Discovery Center in MLSCN Assay provider: John A. Katzenellenbogen, ...
PubChem Bioassay (2008)
BindingDB Entry DOI: 10.7270/Q2CF9NHH
Estradiol receptor beta (ERβ)
(Homo sapiens (Human))
BDBM48455
(4-(2-Methyl-thiazol-4-yl)-benzene-1,2-diol | 4-(2-...)
Show SMILES Cc1nc(cs1)-c1ccc(O)c(O)c1
Show InChI InChI=1S/C10H9NO2S/c1-6-11-8(5-14-6)7-2-3-9(12)10(13)4-7/h2-5,12-13H,1H3
PCBioAssay
n/an/a 1.02E+4n/an/an/an/an/an/a
Emory University Molecular Libraries Screening Center
Curated by PubChem BioAssay
Assay Description
NIH Molecular Libraries Screening Centers Network [MLSCN] Emory Chemical Biology Discovery Center in MLSCN Assay provider: John A. Katzenellenbogen, ...
PubChem Bioassay (2007)
BindingDB Entry DOI: 10.7270/Q2WD3Z0J
POsterior Segregation family member (pos-1)
(Caenorhabditis elegans)
BDBM48455
(4-(2-Methyl-thiazol-4-yl)-benzene-1,2-diol | 4-(2-...)
Show SMILES Cc1nc(cs1)-c1ccc(O)c(O)c1
Show InChI InChI=1S/C10H9NO2S/c1-6-11-8(5-14-6)7-2-3-9(12)10(13)4-7/h2-5,12-13H,1H3
PCBioAssay
n/an/an/an/a 3.66E+4n/an/an/an/a
Broad Institute
Curated by PubChem BioAssay
Assay Description
Broad Institute: MLPCN maternal gene expression Project ID: 2024 Keywords: Zinc finger, C. elegans, maternal gene expression, RNA-protein interac...
PubChem Bioassay (2009)
BindingDB Entry DOI: 10.7270/Q28G8J4C
leucine aminopeptidase
(Plasmodium falciparum 3D7)
BDBM48455
(4-(2-Methyl-thiazol-4-yl)-benzene-1,2-diol | 4-(2-...)
Show SMILES Cc1nc(cs1)-c1ccc(O)c(O)c1
Show InChI InChI=1S/C10H9NO2S/c1-6-11-8(5-14-6)7-2-3-9(12)10(13)4-7/h2-5,12-13H,1H3
PCBioAssay
n/an/a 2.51E+4n/an/an/an/an/an/a
SRMLSC
Curated by PubChem BioAssay
Assay Description
Southern Research Molecular Libraries Screening Center (SRMLSC) Southern Research Institute (Birmingham, Alabama) NIH Molecular Libraries Screening...
PubChem Bioassay (2009)
BindingDB Entry DOI: 10.7270/Q27W69N8
M18 aspartyl aminopeptidase
(Plasmodium falciparum 3D7)
BDBM48455
(4-(2-Methyl-thiazol-4-yl)-benzene-1,2-diol | 4-(2-...)
Show SMILES Cc1nc(cs1)-c1ccc(O)c(O)c1
Show InChI InChI=1S/C10H9NO2S/c1-6-11-8(5-14-6)7-2-3-9(12)10(13)4-7/h2-5,12-13H,1H3
PCBioAssay
n/an/a 1.30E+3n/an/an/an/an/an/a
The Scripps Research Institute Molecular Screening Center
Curated by PubChem BioAssay
Assay Description
Source (MLPCN Center Name): The Scripps Research Institute Molecular Screening Center Affiliation: The Scripps Research Institute, TSRI Assay Provide...
PubChem Bioassay (2009)
BindingDB Entry DOI: 10.7270/Q24B2ZQ2
Procathepsin L
(Homo sapiens (Human))
BDBM48455
(4-(2-Methyl-thiazol-4-yl)-benzene-1,2-diol | 4-(2-...)
Show SMILES Cc1nc(cs1)-c1ccc(O)c(O)c1
Show InChI InChI=1S/C10H9NO2S/c1-6-11-8(5-14-6)7-2-3-9(12)10(13)4-7/h2-5,12-13H,1H3
Reactome pathway
PCBioAssay
n/an/a>5.96E+4n/an/an/an/an/an/a
The Scripps Research Institute Molecular Screening Center
Curated by PubChem BioAssay
Assay Description
Source (MLPCN Center Name): The Scripps Research Institute Molecular Screening Center Affiliation: The Scripps Research Institute, TSRI Assay Provide...
PubChem Bioassay (2009)
BindingDB Entry DOI: 10.7270/Q20K2704
RecName: Full=Zinc finger protein mex-5
(Caenorhabditis elegans)
BDBM48455
(4-(2-Methyl-thiazol-4-yl)-benzene-1,2-diol | 4-(2-...)
Show SMILES Cc1nc(cs1)-c1ccc(O)c(O)c1
Show InChI InChI=1S/C10H9NO2S/c1-6-11-8(5-14-6)7-2-3-9(12)10(13)4-7/h2-5,12-13H,1H3
PCBioAssay
n/an/an/an/a 2.13E+4n/an/an/an/a
Broad Institute
Curated by PubChem BioAssay
Assay Description
Broad Institute: MLPCN maternal gene expression Project ID: 2024 Keywords: Zinc finger, C. elegans, maternal gene expression, RNA-protein interac...
PubChem Bioassay (2009)
BindingDB Entry DOI: 10.7270/Q2D798VP