BDBM4853 1-(4-Chlorophenoxy)-4-(4-pyridylmethyl)phthalazine::1-(4-chlorophenoxy)-4-(pyridin-4-ylmethyl)phthalazine::CGP79787 Analog 38
SMILES: Clc1ccc(Oc2nnc(Cc3ccncc3)c3ccccc23)cc1
InChI Key: InChIKey=CCVDZJHZVAQGSW-UHFFFAOYSA-N
Data: 2 IC50
Activity Spreadsheet -- Enzyme Inhibition Constant Data from BindingDB
Found 2 hits for monomerid = 4853
Trg + Lig
Ki
nM
ΔG°
kcal/mole
IC50
nM
Kd
nM
EC50/IC50
nM
koff
s-1
kon
M-1s-1
pHTemp
°C
Vascular endothelial growth factor receptor 2
(Homo sapiens (Human))
BDBM4853
(1-(4-Chlorophenoxy)-4-(4-pyridylmethyl)phthalazine...)
Show SMILES Clc1ccc(Oc2nnc(Cc3ccncc3)c3ccccc23)cc1
Show InChI InChI=1S/C20H14ClN3O/c21-15-5-7-16(8-6-15)25-20-18-4-2-1-3-17(18)19(23-24-20)13-14-9-11-22-12-10-14/h1-12H,13H2
NCI pathway
Reactome pathway
n/an/a 1.60E+3n/an/an/an/an/an/a
Novartis Pharmaceuticals
Assay Description
The in vitro kinase assays were performed in 96-well plates using the recombinant GST-fused kinase domains expressed in baculovirus and purified over...
J Med Chem 43: 2310-23 (2000)
Article DOI: 10.1021/jm9909443
BindingDB Entry DOI: 10.7270/Q24M92R5
Vascular endothelial growth factor receptor 1
(Homo sapiens (Human))
BDBM4853
(1-(4-Chlorophenoxy)-4-(4-pyridylmethyl)phthalazine...)
Show SMILES Clc1ccc(Oc2nnc(Cc3ccncc3)c3ccccc23)cc1
Show InChI InChI=1S/C20H14ClN3O/c21-15-5-7-16(8-6-15)25-20-18-4-2-1-3-17(18)19(23-24-20)13-14-9-11-22-12-10-14/h1-12H,13H2
n/an/a 60n/an/an/an/a7.522
Novartis Pharmaceuticals
Assay Description
The in vitro kinase assays were performed in 96-well plates using the recombinant GST-fused kinase domains expressed in baculovirus and purified over...
J Med Chem 43: 2310-23 (2000)
Article DOI: 10.1021/jm9909443
BindingDB Entry DOI: 10.7270/Q24M92R5