BDBM4857 1-(4-Chloroanilino)-4-(4-pyrimidylmethyl)phthalazine::CGP79787 Analog 42::N-(4-chlorophenyl)-4-(pyrimidin-4-ylmethyl)phthalazin-1-amine
SMILES: Clc1ccc(Nc2nnc(Cc3ccncn3)c3ccccc23)cc1
InChI Key: InChIKey=QGCUYXCPMZGMFQ-UHFFFAOYSA-N
Data: 2 IC50
Activity Spreadsheet -- Enzyme Inhibition Constant Data from BindingDB
Found 2 hits for monomerid = 4857
Trg + Lig
Ki
nM
ΔG°
kcal/mole
IC50
nM
Kd
nM
EC50/IC50
nM
koff
s-1
kon
M-1s-1
pHTemp
°C
Vascular endothelial growth factor receptor 2
(Homo sapiens (Human))
BDBM4857
(1-(4-Chloroanilino)-4-(4-pyrimidylmethyl)phthalazi...)
Show SMILES Clc1ccc(Nc2nnc(Cc3ccncn3)c3ccccc23)cc1
Show InChI InChI=1S/C19H14ClN5/c20-13-5-7-14(8-6-13)23-19-17-4-2-1-3-16(17)18(24-25-19)11-15-9-10-21-12-22-15/h1-10,12H,11H2,(H,23,25)
NCI pathway
Reactome pathway
n/an/a 410n/an/an/an/an/an/a
Novartis Pharmaceuticals
Assay Description
The in vitro kinase assays were performed in 96-well plates using the recombinant GST-fused kinase domains expressed in baculovirus and purified over...
J Med Chem 43: 2310-23 (2000)
Article DOI: 10.1021/jm9909443
BindingDB Entry DOI: 10.7270/Q24M92R5
Vascular endothelial growth factor receptor 1
(Homo sapiens (Human))
BDBM4857
(1-(4-Chloroanilino)-4-(4-pyrimidylmethyl)phthalazi...)
Show SMILES Clc1ccc(Nc2nnc(Cc3ccncn3)c3ccccc23)cc1
Show InChI InChI=1S/C19H14ClN5/c20-13-5-7-14(8-6-13)23-19-17-4-2-1-3-16(17)18(24-25-19)11-15-9-10-21-12-22-15/h1-10,12H,11H2,(H,23,25)
n/an/a 760n/an/an/an/a7.522
Novartis Pharmaceuticals
Assay Description
The in vitro kinase assays were performed in 96-well plates using the recombinant GST-fused kinase domains expressed in baculovirus and purified over...
J Med Chem 43: 2310-23 (2000)
Article DOI: 10.1021/jm9909443
BindingDB Entry DOI: 10.7270/Q24M92R5