null
SMILES: O=c1[nH]c2ccccc2n2c(nnc12)-c1ccccc1
InChI Key: InChIKey=WNTCOOOGTSGZLG-UHFFFAOYSA-N
Activity Spreadsheet -- Enzyme Inhibition Constant Data from BindingDB
Found 8 hits for monomerid = 48678
Trg + Lig
Ki
nM
ΔG°
kcal/mole
IC50
nM
Kd
nM
EC50/IC50
nM
koff
s-1
kon
M-1s-1
pHTemp
°C
Eukaryotic translation initiation factor 4 gamma 1
(Homo sapiens (Human))
BDBM48678
(1-phenyl-5H-[1,2,4]triazolo[4,3-a]quinoxalin-4-one...)
Show SMILES O=c1[nH]c2ccccc2n2c(nnc12)-c1ccccc1
Show InChI InChI=1S/C15H10N4O/c20-15-14-18-17-13(10-6-2-1-3-7-10)19(14)12-9-5-4-8-11(12)16-15/h1-9H,(H,16,20)
Reactome pathway
PCBioAssay
n/an/a 3.44E+4n/an/an/an/an/an/a
Emory University Molecular Libraries Screening Center
Curated by PubChem BioAssay
Assay Description
Dose Response Confirmation for Small Molecule Inhibitors of Eukaryotic Translation Initiation NIH Molecular Libraries Screening Centers Network [MLSC...
PubChem Bioassay (2009)
BindingDB Entry DOI: 10.7270/Q2RN3686
E3 ubiquitin-protein ligase XIAP
(Homo sapiens (Human))
BDBM48678
(1-phenyl-5H-[1,2,4]triazolo[4,3-a]quinoxalin-4-one...)
Show SMILES O=c1[nH]c2ccccc2n2c(nnc12)-c1ccccc1
Show InChI InChI=1S/C15H10N4O/c20-15-14-18-17-13(10-6-2-1-3-7-10)19(14)12-9-5-4-8-11(12)16-15/h1-9H,(H,16,20)
PCBioAssay
n/an/a 1.00E+5n/an/an/an/an/an/a
Sanford-Burnham Center for Chemical Genomics
Curated by PubChem BioAssay
Assay Description
Data Source: Sanford-Burnham Center for Chemical Genomics (SBCCG) Source Affiliation: Sanford-Burnham Medical Research Institute (SBMRI, San Diego, C...
PubChem Bioassay (2008)
BindingDB Entry DOI: 10.7270/Q2HD7T4S
Hexokinase HKDC1 [W721R]
(Homo sapiens (Human))
BDBM48678
(1-phenyl-5H-[1,2,4]triazolo[4,3-a]quinoxalin-4-one...)
Show SMILES O=c1[nH]c2ccccc2n2c(nnc12)-c1ccccc1
Show InChI InChI=1S/C15H10N4O/c20-15-14-18-17-13(10-6-2-1-3-7-10)19(14)12-9-5-4-8-11(12)16-15/h1-9H,(H,16,20)
PCBioAssay
n/an/a 7.52E+3n/an/an/an/an/an/a
Burnham Center for Chemical Genomics
Curated by PubChem BioAssay
Assay Description
Data Source: Sanford-Burnham Center for Chemical Genomics (SBCCG) Source Affiliation: Sanford-Burnham Medical Research Institute (SBMRI, San Diego, C...
PubChem Bioassay (2011)
BindingDB Entry DOI: 10.7270/Q2W094D4
Glucose-6-phosphate dehydrogenase-6-phosphogluconolactonase
(Plasmodium falciparum 3D7)
BDBM48678
(1-phenyl-5H-[1,2,4]triazolo[4,3-a]quinoxalin-4-one...)
Show SMILES O=c1[nH]c2ccccc2n2c(nnc12)-c1ccccc1
Show InChI InChI=1S/C15H10N4O/c20-15-14-18-17-13(10-6-2-1-3-7-10)19(14)12-9-5-4-8-11(12)16-15/h1-9H,(H,16,20)
PCBioAssay
n/an/a 1.32E+4n/an/an/an/an/an/a
Burnham Center for Chemical Genomics
Curated by PubChem BioAssay
Assay Description
Data Source: Sanford-Burnham Center for Chemical Genomics (SBCCG) Source Affiliation: Sanford-Burnham Medical Research Institute (SBMRI, San Diego CA...
PubChem Bioassay (2011)
BindingDB Entry DOI: 10.7270/Q23T9FQ1
Hexokinase HKDC1 [W721R]
(Homo sapiens (Human))
BDBM48678
(1-phenyl-5H-[1,2,4]triazolo[4,3-a]quinoxalin-4-one...)
Show SMILES O=c1[nH]c2ccccc2n2c(nnc12)-c1ccccc1
Show InChI InChI=1S/C15H10N4O/c20-15-14-18-17-13(10-6-2-1-3-7-10)19(14)12-9-5-4-8-11(12)16-15/h1-9H,(H,16,20)
PCBioAssay
n/an/a 1.90E+4n/an/an/an/an/an/a
Burnham Center for Chemical Genomics
Curated by PubChem BioAssay
Assay Description
Data Source: Sanford-Burnham Center for Chemical Genomics (SBCCG) Source Affiliation: Sanford-Burnham Medical Research Institute (SBMRI, San Diego, C...
PubChem Bioassay (2011)
BindingDB Entry DOI: 10.7270/Q23F4N3R
Glucose-6-phosphate dehydrogenase-6-phosphogluconolactonase
(Plasmodium falciparum 3D7)
BDBM48678
(1-phenyl-5H-[1,2,4]triazolo[4,3-a]quinoxalin-4-one...)
Show SMILES O=c1[nH]c2ccccc2n2c(nnc12)-c1ccccc1
Show InChI InChI=1S/C15H10N4O/c20-15-14-18-17-13(10-6-2-1-3-7-10)19(14)12-9-5-4-8-11(12)16-15/h1-9H,(H,16,20)
PCBioAssay
n/an/a 1.65E+3n/an/an/an/an/an/a
Burnham Center for Chemical Genomics
Curated by PubChem BioAssay
Assay Description
Data Source: Sanford-Burnham Center for Chemical Genomics (SBCCG) Source Affiliation: Sanford-Burnham Medical Research Institute (SBMRI, San Diego CA...
PubChem Bioassay (2011)
BindingDB Entry DOI: 10.7270/Q2ZS2TZG
Glucose-6-phosphate dehydrogenase-6-phosphogluconolactonase
(Plasmodium falciparum 3D7)
BDBM48678
(1-phenyl-5H-[1,2,4]triazolo[4,3-a]quinoxalin-4-one...)
Show SMILES O=c1[nH]c2ccccc2n2c(nnc12)-c1ccccc1
Show InChI InChI=1S/C15H10N4O/c20-15-14-18-17-13(10-6-2-1-3-7-10)19(14)12-9-5-4-8-11(12)16-15/h1-9H,(H,16,20)
PCBioAssay
n/an/a>8.00E+4n/an/an/an/an/an/a
Burnham Center for Chemical Genomics
Curated by PubChem BioAssay
Assay Description
Data Source: Sanford-Burnham Center for Chemical Genomics (SBCCG) Source Affiliation: Sanford-Burnham Medical Research Institute (SBMRI, San Diego CA...
PubChem Bioassay (2011)
BindingDB Entry DOI: 10.7270/Q27H1H3W
Glucose-6-phosphate 1-dehydrogenase
(Homo sapiens (Human))
BDBM48678
(1-phenyl-5H-[1,2,4]triazolo[4,3-a]quinoxalin-4-one...)
Show SMILES O=c1[nH]c2ccccc2n2c(nnc12)-c1ccccc1
Show InChI InChI=1S/C15H10N4O/c20-15-14-18-17-13(10-6-2-1-3-7-10)19(14)12-9-5-4-8-11(12)16-15/h1-9H,(H,16,20)
PCBioAssay
n/an/a 4.16E+4n/an/an/an/an/an/a
Burnham Center for Chemical Genomics
Curated by PubChem BioAssay
Assay Description
Data Source: Sanford-Burnham Center for Chemical Genomics (SBCCG) Source Affiliation: Sanford-Burnham Medical Research Institute (SBMRI, San Diego CA...
PubChem Bioassay (2011)
BindingDB Entry DOI: 10.7270/Q2V12389