BDBM4876 1-(3,4-Dichloroanilino)-4-(4-pyridylmethyl)phthalazine::CGP79787 Analog 61::N-(3,4-dichlorophenyl)-4-(pyridin-4-ylmethyl)phthalazin-1-amine
SMILES: Clc1ccc(Nc2nnc(Cc3ccncc3)c3ccccc23)cc1Cl
InChI Key: InChIKey=UIFQBRNVJVUAKO-UHFFFAOYSA-N
Data: 4 IC50
Activity Spreadsheet -- Enzyme Inhibition Constant Data from BindingDB
Found 4 hits for monomerid = 4876
Trg + Lig
Ki
nM
ΔG°
kcal/mole
IC50
nM
Kd
nM
EC50/IC50
nM
koff
s-1
kon
M-1s-1
pHTemp
°C
Vascular endothelial growth factor receptor 1
(Homo sapiens (Human))
BDBM4876
(1-(3,4-Dichloroanilino)-4-(4-pyridylmethyl)phthala...)
Show SMILES Clc1ccc(Nc2nnc(Cc3ccncc3)c3ccccc23)cc1Cl
Show InChI InChI=1S/C20H14Cl2N4/c21-17-6-5-14(12-18(17)22)24-20-16-4-2-1-3-15(16)19(25-26-20)11-13-7-9-23-10-8-13/h1-10,12H,11H2,(H,24,26)
n/an/a 70n/an/an/an/an/an/a
Novartis Pharmaceuticals
Assay Description
The in vitro kinase assays were performed in 96-well plates using the recombinant GST-fused kinase domains expressed in baculovirus and purified over...
J Med Chem 43: 2310-23 (2000)
Article DOI: 10.1021/jm9909443
BindingDB Entry DOI: 10.7270/Q24M92R5
Mast/stem cell growth factor receptor Kit
(Homo sapiens (Human))
BDBM4876
(1-(3,4-Dichloroanilino)-4-(4-pyridylmethyl)phthala...)
Show SMILES Clc1ccc(Nc2nnc(Cc3ccncc3)c3ccccc23)cc1Cl
Show InChI InChI=1S/C20H14Cl2N4/c21-17-6-5-14(12-18(17)22)24-20-16-4-2-1-3-15(16)19(25-26-20)11-13-7-9-23-10-8-13/h1-10,12H,11H2,(H,24,26)
n/an/a 700n/an/an/an/an/an/a
Novartis Pharmaceuticals
Assay Description
The in vitro kinase assays were performed in 96-well plates using the recombinant GST-fused kinase domains expressed in baculovirus and purified over...
J Med Chem 43: 2310-23 (2000)
Article DOI: 10.1021/jm9909443
BindingDB Entry DOI: 10.7270/Q24M92R5
Platelet-derived growth factor receptor beta
(Homo sapiens (Human))
BDBM4876
(1-(3,4-Dichloroanilino)-4-(4-pyridylmethyl)phthala...)
Show SMILES Clc1ccc(Nc2nnc(Cc3ccncc3)c3ccccc23)cc1Cl
Show InChI InChI=1S/C20H14Cl2N4/c21-17-6-5-14(12-18(17)22)24-20-16-4-2-1-3-15(16)19(25-26-20)11-13-7-9-23-10-8-13/h1-10,12H,11H2,(H,24,26)
NCI pathway
Reactome pathway
n/an/a 600n/an/an/an/an/an/a
Novartis Pharmaceuticals
Assay Description
The autophosphorylation assay was performed in 96-well plates using the recombinant GST-fused kinase domains expressed in baculovirus and purified ov...
J Med Chem 43: 2310-23 (2000)
Article DOI: 10.1021/jm9909443
BindingDB Entry DOI: 10.7270/Q24M92R5
Vascular endothelial growth factor receptor 2
(Homo sapiens (Human))
BDBM4876
(1-(3,4-Dichloroanilino)-4-(4-pyridylmethyl)phthala...)
Show SMILES Clc1ccc(Nc2nnc(Cc3ccncc3)c3ccccc23)cc1Cl
Show InChI InChI=1S/C20H14Cl2N4/c21-17-6-5-14(12-18(17)22)24-20-16-4-2-1-3-15(16)19(25-26-20)11-13-7-9-23-10-8-13/h1-10,12H,11H2,(H,24,26)
NCI pathway
Reactome pathway
n/an/a 30n/an/an/an/an/an/a
Novartis Pharmaceuticals
Assay Description
The in vitro kinase assays were performed in 96-well plates using the recombinant GST-fused kinase domains expressed in baculovirus and purified over...
J Med Chem 43: 2310-23 (2000)
Article DOI: 10.1021/jm9909443
BindingDB Entry DOI: 10.7270/Q24M92R5