BDBM48775 (4E)-4-[(2-methyl-3-nitro-phenyl)hydrazinylidene]-3-(4-nitrophenyl)-5-oxidanylidene-pyrazole-1-carbothioamide::(4E)-4-[(2-methyl-3-nitrophenyl)hydrazinylidene]-3-(4-nitrophenyl)-5-oxo-1-pyrazolecarbothioamide::(4E)-4-[(2-methyl-3-nitrophenyl)hydrazinylidene]-3-(4-nitrophenyl)-5-oxopyrazole-1-carbothioamide::(4E)-5-keto-4-[(2-methyl-3-nitro-phenyl)hydrazono]-3-(4-nitrophenyl)-2-pyrazoline-1-carbothioamide::MLS000713704::SMR000273185::cid_5950645
SMILES: Cc1c(cccc1[N+]([O-])=O)[NH+]=Nc1c([n-]n(C(N)=S)c1=O)-c1ccc(cc1)[N+]([O-])=O
InChI Key: InChIKey=LQCMIOHGMDGEDS-UHFFFAOYSA-N
Data: 6 IC50
Activity Spreadsheet -- Enzyme Inhibition Constant Data from BindingDB
Found 6 hits for monomerid = 48775
Trg + Lig
Ki
nM
ΔG°
kcal/mole
IC50
nM
Kd
nM
EC50/IC50
nM
koff
s-1
kon
M-1s-1
pHTemp
°C
eukaryotic translation initiation factor 4 gamma, 1 isoform 4
(Homo sapiens (Human))
BDBM48775
((4E)-4-[(2-methyl-3-nitro-phenyl)hydrazinylidene]-...)
Show SMILES Cc1c(cccc1[N+]([O-])=O)[NH+]=Nc1c([n-]n(C(N)=S)c1=O)-c1ccc(cc1)[N+]([O-])=O |w:10.10|
Show InChI InChI=1S/C17H13N7O5S/c1-9-12(3-2-4-13(9)24(28)29)19-20-15-14(21-22(16(15)25)17(18)30)10-5-7-11(8-6-10)23(26)27/h2-8H,1H3,(H3,18,19,21,25,30)
Reactome pathway
PCBioAssay
n/an/a 5.00E+4n/an/an/an/an/an/a
Emory University Molecular Libraries Screening Center
Curated by PubChem BioAssay
Assay Description
Dose Response Confirmation for Small Molecule Inhibitors of Eukaryotic Translation Initiation NIH Molecular Libraries Screening Centers Network [MLSC...
PubChem Bioassay (2009)
BindingDB Entry DOI: 10.7270/Q2RN3686
MKP-3
(Rattus norvegicus)
BDBM48775
((4E)-4-[(2-methyl-3-nitro-phenyl)hydrazinylidene]-...)
Show SMILES Cc1c(cccc1[N+]([O-])=O)[NH+]=Nc1c([n-]n(C(N)=S)c1=O)-c1ccc(cc1)[N+]([O-])=O |w:10.10|
Show InChI InChI=1S/C17H13N7O5S/c1-9-12(3-2-4-13(9)24(28)29)19-20-15-14(21-22(16(15)25)17(18)30)10-5-7-11(8-6-10)23(26)27/h2-8H,1H3,(H3,18,19,21,25,30)
Reactome pathway
PCBioAssay
n/an/a 7.01E+3n/an/an/an/an/an/a
Sanford-Burnham Center for Chemical Genomics
Curated by PubChem BioAssay
Assay Description
Data Source: Sanford-Burnham Center for Chemical Genomics (SBCCG) Source Affiliation: Sanford-Burnham Medical Research Institute (SBMRI, San Diego, C...
PubChem Bioassay (2009)
BindingDB Entry DOI: 10.7270/Q2W66J6B
Voltage-gated calcium channel subunit alpha Cav2.2
(Homo sapiens (Human))
BDBM48775
((4E)-4-[(2-methyl-3-nitro-phenyl)hydrazinylidene]-...)
Show SMILES Cc1c(cccc1[N+]([O-])=O)[NH+]=Nc1c([n-]n(C(N)=S)c1=O)-c1ccc(cc1)[N+]([O-])=O |w:10.10|
Show InChI InChI=1S/C17H13N7O5S/c1-9-12(3-2-4-13(9)24(28)29)19-20-15-14(21-22(16(15)25)17(18)30)10-5-7-11(8-6-10)23(26)27/h2-8H,1H3,(H3,18,19,21,25,30)
PCBioAssay
n/an/a 1.63E+4n/an/an/an/an/an/a
Burnham Center for Chemical Genomics
Curated by PubChem BioAssay
Assay Description
Data Source: Data Source: Sanford-Burnham Center for Chemical Genomics (SBCCG) Source Affiliation: Sanford-Burnham Medical Research Institute Network...
PubChem Bioassay (2009)
BindingDB Entry DOI: 10.7270/Q2PZ578V
Dual specificity protein phosphatase (VHR)
(Homo sapiens (Human))
BDBM48775
((4E)-4-[(2-methyl-3-nitro-phenyl)hydrazinylidene]-...)
Show SMILES Cc1c(cccc1[N+]([O-])=O)[NH+]=Nc1c([n-]n(C(N)=S)c1=O)-c1ccc(cc1)[N+]([O-])=O |w:10.10|
Show InChI InChI=1S/C17H13N7O5S/c1-9-12(3-2-4-13(9)24(28)29)19-20-15-14(21-22(16(15)25)17(18)30)10-5-7-11(8-6-10)23(26)27/h2-8H,1H3,(H3,18,19,21,25,30)
Reactome pathway
PCBioAssay
n/an/a 1.71E+3n/an/an/an/an/an/a
Burnham Center for Chemical Genomics
Curated by PubChem BioAssay
Assay Description
Data Source: Sanford-Burnham Center for Chemical Genomics (SBCCG) Source Affiliation: Sanford-Burnham Medical Research Institute (SBMRI, San Diego, C...
PubChem Bioassay (2009)
BindingDB Entry DOI: 10.7270/Q29G5K79
Dual specificity protein phosphatase (VHR)
(Homo sapiens (Human))
BDBM48775
((4E)-4-[(2-methyl-3-nitro-phenyl)hydrazinylidene]-...)
Show SMILES Cc1c(cccc1[N+]([O-])=O)[NH+]=Nc1c([n-]n(C(N)=S)c1=O)-c1ccc(cc1)[N+]([O-])=O |w:10.10|
Show InChI InChI=1S/C17H13N7O5S/c1-9-12(3-2-4-13(9)24(28)29)19-20-15-14(21-22(16(15)25)17(18)30)10-5-7-11(8-6-10)23(26)27/h2-8H,1H3,(H3,18,19,21,25,30)
Reactome pathway
PCBioAssay
n/an/a 3.37E+3n/an/an/an/an/an/a
Burnham Center for Chemical Genomics
Curated by PubChem BioAssay
Assay Description
Data Source: Sanford-Burnham Center for Chemical Genomics (SBCCG) Source Affiliation: Sanford-Burnham Medical Research Institute (SBMRI, San Diego, C...
PubChem Bioassay (2009)
BindingDB Entry DOI: 10.7270/Q2445JXV
Induced myeloid leukemia cell differentiation protein Mcl-1
(Homo sapiens (Human))
BDBM48775
((4E)-4-[(2-methyl-3-nitro-phenyl)hydrazinylidene]-...)
Show SMILES Cc1c(cccc1[N+]([O-])=O)[NH+]=Nc1c([n-]n(C(N)=S)c1=O)-c1ccc(cc1)[N+]([O-])=O |w:10.10|
Show InChI InChI=1S/C17H13N7O5S/c1-9-12(3-2-4-13(9)24(28)29)19-20-15-14(21-22(16(15)25)17(18)30)10-5-7-11(8-6-10)23(26)27/h2-8H,1H3,(H3,18,19,21,25,30)
NCI pathway
PCBioAssay
n/an/a 6.05E+3n/an/an/an/an/an/a
Emory University Molecular Libraries Screening Center
Curated by PubChem BioAssay
Assay Description
NIH Molecular Libraries Screening Centers Network [MLSCN] Emory Chemical Biology Discovery Center in MLSCN Assay provider: Nikolovska-Coleska, Univer...
PubChem Bioassay (2008)
BindingDB Entry DOI: 10.7270/Q23X8539